{"text_format":"3","workbook":"xlsx","n_sheets":37,"sheets":["Beginn","2010","2011","2012","2013","2014","2015","2016","2017","2018","2019","2020","2021","2022","2023","2024","2025","2026","2027","2028","2029","2030","2031","2032","2033","2034","2035","2036","2037","2038","2039","2040","2041","total","Jahresabschluss","Diagramme","ET2&TaEF"],"not_rendered":{"charts":2,"images":2,"macros":1,"defined_names":5},"read":"whole","date_system":"1900"}

{"sheet":"Beginn","index":0,"n_rows":42,"n_cols":17,"rows_kept":42,"merged":[[12,0,12,4],[13,0,13,4],[14,0,14,3],[17,0,17,4],[18,0,18,4],[21,0,21,3],[21,4,21,10],[22,0,22,3],[22,4,22,10],[23,0,23,3],[23,4,23,10],[24,0,24,3],[24,4,24,10],[25,0,25,3],[25,4,25,10],[26,0,26,3],[26,4,26,10],[27,0,27,3],[27,4,27,10],[28,0,28,3],[28,4,28,10],[29,0,29,3],[29,4,29,10],[30,0,30,3],[30,4,30,10],[31,0,31,3],[31,4,31,10],[32,0,32,3],[32,4,32,10],[32,14,33,15],[33,0,33,3],[33,4,33,10],[34,0,34,3],[34,4,34,10],[35,0,35,3],[35,4,35,10],[38,0,38,3],[38,4,38,10],[39,0,39,3],[39,4,39,10],[41,0,41,3],[41,4,41,10]]}
[]
[]
[null,null,"GUV"]
[null,null,"Privat"]
[null,null,"CMAS"]
[null,null,{"v":4,"d":"4 "}]
[null,null,{"v":5,"d":"5 "}]
[null,null,{"v":6,"d":"6 "}]
[]
[]
[]
[{"$nulls":5},{"$f":"IF(AND(ISNUMBER(D12),ISNUMBER(#REF!)),#REF!-D12,\"\")","v":""},null,{"$f":"IF(AND(G12=\"GUV\",ISNUMBER(F12)),F12,\"\")","v":""},{"$f":"IF(AND(ISNUMBER(I11),ISNUMBER(J11),ISNUMBER(F12)),INT((I11*60+J11+(HOUR(F12)*60)+MINUTE(F12))/60),\"\")","v":""},{"$f":"IF(AND(ISNUMBER(I12)),(I11*60+J11+(HOUR(F12)*60)+MINUTE(F12))-(I12*60),\"\")","v":""}]
["Anzahl GUV Tauchgänge",{"$nulls":4},0,"Anzahl aller GUV-Tauchgänge"]
["GUV hh:mm",{"$nulls":4},0,"Gesamtstunden aller GUV-Tauchgänge"]
[{"$nulls":7},"","",""]
[{"$nulls":7},"","",""]
[{"$nulls":7},"","",""]
["Anzahl Gesamttauchgänge",{"$nulls":4},0,"Anzahl aller Tauchgänge (GUV und PRIVAT)"]
["Anzahl Gesamtstunde hh:mm",{"$nulls":4},0,"Gesamtstunden aller Tauchgänge (GUV und Privat)"]
[]
[]
["Name",{"$nulls":3},"<Name>"]
["Vorname",{"$nulls":3},"<Vorname>"]
["ET-Nummer",{"$nulls":3},"14/613/XXX/JJJJ"]
["Geb.Datum",{"$nulls":3},"1990-01-01"]
["G31 gültig bis",{"$nulls":3},"1990-12-31"]
["Erfahrener Taucher seit",{"$nulls":3},"Keine",{"$nulls":9},{"$f":"DATE(YEAR(E34)-2,MONTH(E34),DAY(E34))","v":"1986-01-01"}]
["Nitrox Genehmigung seit",{"$nulls":3},"Keine"]
["Berechtigung 30 m gültig bis",{"$nulls":3},"keine"]
["Bestätigt TL / Bez. Tauchwart",{"$nulls":3},"<Name>"]
[]
["CMAS Prüfung am:",{"$nulls":3},"1990-01-01"]
["ET Prüfung am:",{"$nulls":3},"1990-01-01",{"$nulls":9},{"$f":"E34","v":32143},null,"Ab CMAS-(oder Vergleichbar) Prüfung am"]
["ET TG nach dem",{"$nulls":3},{"$f":"DATE(YEAR(E33)-2,MONTH(E32),DAY(E32))","v":"1988-01-01"},{"$nulls":11},"ET-Prüfung -24 Monate"]
["ET Prüfung bestanden am:"]
["TaEF möglich ab dem ",{"$nulls":3},{"$f":"DATE(YEAR(E35)+3,MONTH(E35),DAY(E35))","v":"1902-12-31"},{"$nulls":11},"50 GUV nach ET"]
[]
[]
["LT Tauchstunden vorhanden",{"$nulls":3},{"$f":"IF((P39+P40)>1,\"JA\",\"NEIN\")","v":"NEIN"},{"$nulls":10},{"$f":"IF(total!K43>60,\"1\",\"0\")","v":"0"},"60 GUV Stunden"]
["LT Prüfung bestanden am",{"$nulls":3},"2021-01-01",{"$nulls":10},{"$f":"IF(total!I42>100,\"1\",\"0\")","v":"0"},"100 GUV TG"]
[]
["Multiplikator Tauchen möglich",{"$nulls":3},{"$f":"IF((N42-E40)>3*365,\"JA\",\"NEIN\")","v":"NEIN"},{"$nulls":8},{"$f":"TODAY()","v":"2022-03-25"},null,null,"3 Jahre LT"]

{"sheet":"2010","index":1,"n_rows":101,"n_cols":19,"rows_kept":101,"merged":[[0,15,0,18],[5,12,5,13]]}
[{"$nulls":15},{"$f":"C2","v":2010}]
[null,null,2010,{"$nulls":12},"Gesamt",null,"GUV"]
[{"$nulls":15},"Anzahl","hh:mm","Anzahl","hh:mm"]
[null,"Tauchgang","Datum","Einstieg","Ausstieg","Tiefe","Art","Bemerkung","Zeit",null,"GUV","Gesamt","GUV","Gesamt",null,{"$f":"COUNT(A7:A100)","v":0},{"$f":"M101+N101","v":0},{"$f":"COUNTIF(G7:G100,\"GUV\")","v":0},{"$f":"M101","v":0}]
[{"$nulls":10},"hh:mm","hh:mm"]
[{"$nulls":10},{"$f":"Beginn!F14","v":0},{"$f":"Beginn!F19","v":0},{"$f":"C2","v":2010}]
[{"$nulls":8},{"$f":"IF(E7>0,E7-D7,0)","v":0},null,{"$f":"IF(G7=\"GUV\",K6+I7,K6)","v":0},{"$f":"L6+I7","v":0},{"$f":"IF(G7=\"GUV\",I7,\" \")","v":" "},{"$f":"IF(G7=\"GUV\",\" \",I7)","v":0}]
[{"$nulls":8},{"$f":"IF(E8>0,E8-D8,0)","v":0},null,{"$f":"IF(G8=\"GUV\",K7+I8,K7)","v":0},{"$f":"L7+I8","v":0},{"$f":"IF(G8=\"GUV\",I8,\" \")","v":" "},{"$f":"IF(G8=\"GUV\",\" \",I8)","v":0}]
[{"$nulls":8},0,null,0,0," ",0]
[{"$nulls":8},0,null,0,0," ",0]
[{"$nulls":8},0,null,0,0," ",0]
[{"$nulls":8},0,null,0,0," ",0]
[{"$nulls":8},0,null,0,0," ",0]
[{"$nulls":8},0,null,0,0," ",0]
[{"$nulls":8},0,null,0,0," ",0]
[{"$nulls":8},0,null,0,0," ",0]
[{"$nulls":8},0,null,0,0," ",0]
[{"$nulls":8},0,null,0,0," ",0]
[{"$nulls":8},0,null,0,0," ",0]
[{"$nulls":8},0,null,0,0," ",0]
[{"$nulls":8},0,null,0,0," ",0]
[{"$nulls":8},0,null,0,0," ",0]
[{"$nulls":8},0,null,0,0," ",0]
[{"$nulls":8},0,null,0,0," ",0]
[{"$nulls":8},0,null,0,0," ",0]
[{"$nulls":8},0,null,0,0," ",0]
[{"$nulls":8},0,null,0,0," ",0]
[{"$nulls":8},0,null,0,0," ",0]
[{"$nulls":8},0,null,0,0," ",0]
[{"$nulls":8},0,null,0,0," ",0]
[{"$nulls":8},0,null,0,0," ",0]
[{"$nulls":8},0,null,0,0," ",0]
[{"$nulls":8},0,null,0,0," ",0]
[{"$nulls":8},0,null,0,0," ",0]
[{"$nulls":8},0,null,0,0," ",0]
[{"$nulls":8},0,null,0,0," ",0]
[{"$nulls":8},0,null,0,0," ",0]
[{"$nulls":8},0,null,0,0," ",0]
[{"$nulls":8},0,null,0,0," ",0]
[{"$nulls":8},0,null,0,0," ",0]
[{"$nulls":8},0,null,0,0," ",0]
[{"$nulls":8},0,null,0,0," ",0]
[{"$nulls":8},0,null,0,0," ",0]
[{"$nulls":8},0,null,0,0," ",0]
[{"$nulls":8},0,null,0,0," ",0]
[{"$nulls":8},0,null,0,0," ",0]
[{"$nulls":8},0,null,0,0," ",0]
[{"$nulls":8},0,null,0,0," ",0]
[{"$nulls":8},0,null,0,0," ",0]
[{"$nulls":8},0,null,0,0," ",0]
[{"$nulls":8},0,null,0,0," ",0]
[{"$nulls":8},0,null,0,0," ",0]
[{"$nulls":8},0,null,0,0," ",0]
[{"$nulls":8},0,null,0,0," ",0]
[{"$nulls":8},0,null,0,0," ",0]
[{"$nulls":8},0,null,0,0," ",0]
[{"$nulls":8},0,null,0,0," ",0]
[{"$nulls":8},0,null,0,0," ",0]
[{"$nulls":8},0,null,0,0," ",0]
[{"$nulls":8},0,null,0,0," ",0]
[{"$nulls":8},0,null,0,0," ",0]
[{"$nulls":8},0,null,0,0," ",0]
[{"$nulls":8},0,null,0,0," ",0]
[{"$nulls":8},0,null,0,0," ",0]
[{"$nulls":8},0,null,0,0," ",0]
[{"$nulls":8},0,null,0,0," ",0]
[{"$nulls":8},0,null,0,0," ",0]
[{"$nulls":8},0,null,0,0," ",0]
[{"$nulls":8},0,null,0,0," ",0]
[{"$nulls":8},0,null,0,0," ",0]
[{"$nulls":8},0,null,0,0," ",0]
[{"$nulls":8},{"$f":"IF(E72>0,E72-D72,0)","v":0},null,{"$f":"IF(G72=\"GUV\",K71+I72,K71)","v":0},{"$f":"L71+I72","v":0},{"$f":"IF(G72=\"GUV\",I72,\" \")","v":" "},{"$f":"IF(G72=\"GUV\",\" \",I72)","v":0}]
[{"$nulls":8},0,null,0,0," ",0]
[{"$nulls":8},0,null,0,0," ",0]
[{"$nulls":8},0,null,0,0," ",0]
[{"$nulls":8},0,null,0,0," ",0]
[{"$nulls":8},0,null,0,0," ",0]
[{"$nulls":8},0,null,0,0," ",0]
[{"$nulls":8},0,null,0,0," ",0]
[{"$nulls":8},0,null,0,0," ",0]
[{"$nulls":8},0,null,0,0," ",0]
[{"$nulls":8},0,null,0,0," ",0]
[{"$nulls":8},0,null,0,0," ",0]
[{"$nulls":8},0,null,0,0," ",0]
[{"$nulls":8},0,null,0,0," ",0]
[{"$nulls":8},0,null,0,0," ",0]
[{"$nulls":8},0,null,0,0," ",0]
[{"$nulls":8},0,null,0,0," ",0]
[{"$nulls":8},0,null,0,0," ",0]
[{"$nulls":8},0,null,0,0," ",0]
[{"$nulls":8},0,null,0,0," ",0]
[{"$nulls":8},0,null,0,0," ",0]
[{"$nulls":8},0,null,0,0," ",0]
[{"$nulls":8},0,null,0,0," ",0]
[{"$nulls":8},0,null,0,0," ",0]
[{"$nulls":8},0,null,0,0," ",0]
[{"$nulls":8},0,null,0,0," ",0]
[{"$nulls":8},0,null,0,0," ",0]
[{"$nulls":8},0,null,0,0," ",0]
[{"$nulls":8},0,null,0,0," ",0]
[{"$nulls":10},{"$f":"MAX(K6:K100)","v":0},{"$f":"MAX(L6:L100)","v":0},{"$f":"SUM(M7:M100)","v":0},{"$f":"SUM(N7:N100)","v":0}]

{"sheet":"2011","index":2,"n_rows":101,"n_cols":19,"rows_kept":101,"merged":[[0,15,0,18],[5,12,5,13]]}
[{"$nulls":15},{"$f":"C2","v":2011}]
[null,null,2011,{"$nulls":12},"Gesamt",null,"GUV"]
[{"$nulls":15},"Anzahl","hh:mm","Anzahl","hh:mm"]
[null,"Tauchgang","Datum","Einstieg","Ausstieg","Tiefe","Art","Bemerkung","Zeit",null,"GUV","Gesamt","GUV","Gesamt",null,{"$f":"COUNT(A7:A100)","v":0},{"$f":"M101+N101","v":0},{"$f":"COUNTIF(G7:G100,\"GUV\")","v":0},{"$f":"M101","v":0}]
[{"$nulls":10},"hh:mm","hh:mm"]
[{"$nulls":10},{"$f":"'2010'!$K$101","v":0},{"$f":"'2010'!$L$101","v":0},{"$f":"C2","v":2011}]
[{"$nulls":8},{"$f":"IF(E7>0,E7-D7,0)","v":0},null,{"$f":"IF(G7=\"GUV\",K6+I7,K6)","v":0},{"$f":"L6+I7","v":0},{"$f":"IF(G7=\"GUV\",I7,\" \")","v":" "},{"$f":"IF(G7=\"GUV\",\" \",I7)","v":0}]
[{"$nulls":8},{"$f":"IF(E8>0,E8-D8,0)","v":0},null,{"$f":"IF(G8=\"GUV\",K7+I8,K7)","v":0},{"$f":"L7+I8","v":0},{"$f":"IF(G8=\"GUV\",I8,\" \")","v":" "},{"$f":"IF(G8=\"GUV\",\" \",I8)","v":0}]
[{"$nulls":8},0,null,0,0," ",0]
[{"$nulls":8},0,null,0,0," ",0]
[{"$nulls":8},0,null,0,0," ",0]
[{"$nulls":8},0,null,0,0," ",0]
[{"$nulls":8},0,null,0,0," ",0]
[{"$nulls":8},0,null,0,0," ",0]
[{"$nulls":8},0,null,0,0," ",0]
[{"$nulls":8},0,null,0,0," ",0]
[{"$nulls":8},0,null,0,0," ",0]
[{"$nulls":8},0,null,0,0," ",0]
[{"$nulls":8},0,null,0,0," ",0]
[{"$nulls":8},0,null,0,0," ",0]
[{"$nulls":8},0,null,0,0," ",0]
[{"$nulls":8},0,null,0,0," ",0]
[{"$nulls":8},0,null,0,0," ",0]
[{"$nulls":8},0,null,0,0," ",0]
[{"$nulls":8},0,null,0,0," ",0]
[{"$nulls":8},0,null,0,0," ",0]
[{"$nulls":8},0,null,0,0," ",0]
[{"$nulls":8},0,null,0,0," ",0]
[{"$nulls":8},0,null,0,0," ",0]
[{"$nulls":8},0,null,0,0," ",0]
[{"$nulls":8},0,null,0,0," ",0]
[{"$nulls":8},0,null,0,0," ",0]
[{"$nulls":8},0,null,0,0," ",0]
[{"$nulls":8},0,null,0,0," ",0]
[{"$nulls":8},0,null,0,0," ",0]
[{"$nulls":8},0,null,0,0," ",0]
[{"$nulls":8},0,null,0,0," ",0]
[{"$nulls":8},0,null,0,0," ",0]
[{"$nulls":8},0,null,0,0," ",0]
[{"$nulls":8},0,null,0,0," ",0]
[{"$nulls":8},0,null,0,0," ",0]
[{"$nulls":8},0,null,0,0," ",0]
[{"$nulls":8},0,null,0,0," ",0]
[{"$nulls":8},0,null,0,0," ",0]
[{"$nulls":8},0,null,0,0," ",0]
[{"$nulls":8},0,null,0,0," ",0]
[{"$nulls":8},0,null,0,0," ",0]
[{"$nulls":8},0,null,0,0," ",0]
[{"$nulls":8},0,null,0,0," ",0]
[{"$nulls":8},0,null,0,0," ",0]
[{"$nulls":8},0,null,0,0," ",0]
[{"$nulls":8},0,null,0,0," ",0]
[{"$nulls":8},0,null,0,0," ",0]
[{"$nulls":8},0,null,0,0," ",0]
[{"$nulls":8},0,null,0,0," ",0]
[{"$nulls":8},0,null,0,0," ",0]
[{"$nulls":8},0,null,0,0," ",0]
[{"$nulls":8},0,null,0,0," ",0]
[{"$nulls":8},0,null,0,0," ",0]
[{"$nulls":8},0,null,0,0," ",0]
[{"$nulls":8},0,null,0,0," ",0]
[{"$nulls":8},0,null,0,0," ",0]
[{"$nulls":8},0,null,0,0," ",0]
[{"$nulls":8},0,null,0,0," ",0]
[{"$nulls":8},0,null,0,0," ",0]
[{"$nulls":8},0,null,0,0," ",0]
[{"$nulls":8},0,null,0,0," ",0]
[{"$nulls":8},0,null,0,0," ",0]
[{"$nulls":8},0,null,0,0," ",0]
[{"$nulls":8},0,null,0,0," ",0]
[{"$nulls":8},0,null,0,0," ",0]
[{"$nulls":8},{"$f":"IF(E72>0,E72-D72,0)","v":0},null,{"$f":"IF(G72=\"GUV\",K71+I72,K71)","v":0},{"$f":"L71+I72","v":0},{"$f":"IF(G72=\"GUV\",I72,\" \")","v":" "},{"$f":"IF(G72=\"GUV\",\" \",I72)","v":0}]
[{"$nulls":8},0,null,0,0," ",0]
[{"$nulls":8},0,null,0,0," ",0]
[{"$nulls":8},0,null,0,0," ",0]
[{"$nulls":8},0,null,0,0," ",0]
[{"$nulls":8},0,null,0,0," ",0]
[{"$nulls":8},0,null,0,0," ",0]
[{"$nulls":8},0,null,0,0," ",0]
[{"$nulls":8},0,null,0,0," ",0]
[{"$nulls":8},0,null,0,0," ",0]
[{"$nulls":8},0,null,0,0," ",0]
[{"$nulls":8},0,null,0,0," ",0]
[{"$nulls":8},0,null,0,0," ",0]
[{"$nulls":8},0,null,0,0," ",0]
[{"$nulls":8},0,null,0,0," ",0]
[{"$nulls":8},0,null,0,0," ",0]
[{"$nulls":8},0,null,0,0," ",0]
[{"$nulls":8},0,null,0,0," ",0]
[{"$nulls":8},0,null,0,0," ",0]
[{"$nulls":8},0,null,0,0," ",0]
[{"$nulls":8},0,null,0,0," ",0]
[{"$nulls":8},0,null,0,0," ",0]
[{"$nulls":8},0,null,0,0," ",0]
[{"$nulls":8},0,null,0,0," ",0]
[{"$nulls":8},0,null,0,0," ",0]
[{"$nulls":8},0,null,0,0," ",0]
[{"$nulls":8},0,null,0,0," ",0]
[{"$nulls":8},0,null,0,0," ",0]
[{"$nulls":8},0,null,0,0," ",0]
[{"$nulls":10},{"$f":"MAX(K6:K100)","v":0},{"$f":"MAX(L6:L100)","v":0},{"$f":"SUM(M7:M100)","v":0},{"$f":"SUM(N7:N100)","v":0}]

{"sheet":"2012","index":3,"n_rows":101,"n_cols":19,"rows_kept":101,"merged":[[0,15,0,18],[5,12,5,13]]}
[{"$nulls":15},{"$f":"C2","v":2012}]
[null,null,2012,{"$nulls":12},"Gesamt",null,"GUV"]
[{"$nulls":15},"Anzahl","hh:mm","Anzahl","hh:mm"]
[null,"Tauchgang","Datum","Einstieg","Ausstieg","Tiefe","Art","Bemerkung","Zeit",null,"GUV","Gesamt","GUV","Gesamt",null,{"$f":"COUNT(A7:A100)","v":0},{"$f":"M101+N101","v":0},{"$f":"COUNTIF(G7:G100,\"GUV\")","v":0},{"$f":"M101","v":0}]
[{"$nulls":10},"hh:mm","hh:mm"]
[{"$nulls":10},{"$f":"'2011'!$K$101","v":0},{"$f":"'2011'!$L$101","v":0},{"$f":"C2","v":2012}]
[{"$nulls":8},{"$f":"IF(E7>0,E7-D7,0)","v":0},null,{"$f":"IF(G7=\"GUV\",K6+I7,K6)","v":0},{"$f":"L6+I7","v":0},{"$f":"IF(G7=\"GUV\",I7,\" \")","v":" "},{"$f":"IF(G7=\"GUV\",\" \",I7)","v":0}]
[{"$nulls":8},{"$f":"IF(E8>0,E8-D8,0)","v":0},null,{"$f":"IF(G8=\"GUV\",K7+I8,K7)","v":0},{"$f":"L7+I8","v":0},{"$f":"IF(G8=\"GUV\",I8,\" \")","v":" "},{"$f":"IF(G8=\"GUV\",\" \",I8)","v":0}]
[{"$nulls":8},0,null,0,0," ",0]
[{"$nulls":8},0,null,0,0," ",0]
[{"$nulls":8},0,null,0,0," ",0]
[{"$nulls":8},0,null,0,0," ",0]
[{"$nulls":8},0,null,0,0," ",0]
[{"$nulls":8},0,null,0,0," ",0]
[{"$nulls":8},0,null,0,0," ",0]
[{"$nulls":8},0,null,0,0," ",0]
[{"$nulls":8},0,null,0,0," ",0]
[{"$nulls":8},0,null,0,0," ",0]
[{"$nulls":8},0,null,0,0," ",0]
[{"$nulls":8},0,null,0,0," ",0]
[{"$nulls":8},0,null,0,0," ",0]
[{"$nulls":8},0,null,0,0," ",0]
[{"$nulls":8},0,null,0,0," ",0]
[{"$nulls":8},0,null,0,0," ",0]
[{"$nulls":8},0,null,0,0," ",0]
[{"$nulls":8},0,null,0,0," ",0]
[{"$nulls":8},0,null,0,0," ",0]
[{"$nulls":8},0,null,0,0," ",0]
[{"$nulls":8},0,null,0,0," ",0]
[{"$nulls":8},0,null,0,0," ",0]
[{"$nulls":8},0,null,0,0," ",0]
[{"$nulls":8},0,null,0,0," ",0]
[{"$nulls":8},0,null,0,0," ",0]
[{"$nulls":8},0,null,0,0," ",0]
[{"$nulls":8},0,null,0,0," ",0]
[{"$nulls":8},0,null,0,0," ",0]
[{"$nulls":8},0,null,0,0," ",0]
[{"$nulls":8},0,null,0,0," ",0]
[{"$nulls":8},0,null,0,0," ",0]
[{"$nulls":8},0,null,0,0," ",0]
[{"$nulls":8},0,null,0,0," ",0]
[{"$nulls":8},0,null,0,0," ",0]
[{"$nulls":8},0,null,0,0," ",0]
[{"$nulls":8},0,null,0,0," ",0]
[{"$nulls":8},0,null,0,0," ",0]
[{"$nulls":8},0,null,0,0," ",0]
[{"$nulls":8},0,null,0,0," ",0]
[{"$nulls":8},0,null,0,0," ",0]
[{"$nulls":8},0,null,0,0," ",0]
[{"$nulls":8},0,null,0,0," ",0]
[{"$nulls":8},0,null,0,0," ",0]
[{"$nulls":8},0,null,0,0," ",0]
[{"$nulls":8},0,null,0,0," ",0]
[{"$nulls":8},0,null,0,0," ",0]
[{"$nulls":8},0,null,0,0," ",0]
[{"$nulls":8},0,null,0,0," ",0]
[{"$nulls":8},0,null,0,0," ",0]
[{"$nulls":8},0,null,0,0," ",0]
[{"$nulls":8},0,null,0,0," ",0]
[{"$nulls":8},0,null,0,0," ",0]
[{"$nulls":8},0,null,0,0," ",0]
[{"$nulls":8},0,null,0,0," ",0]
[{"$nulls":8},0,null,0,0," ",0]
[{"$nulls":8},0,null,0,0," ",0]
[{"$nulls":8},0,null,0,0," ",0]
[{"$nulls":8},0,null,0,0," ",0]
[{"$nulls":8},0,null,0,0," ",0]
[{"$nulls":8},0,null,0,0," ",0]
[{"$nulls":8},0,null,0,0," ",0]
[{"$nulls":8},0,null,0,0," ",0]
[{"$nulls":8},0,null,0,0," ",0]
[{"$nulls":8},{"$f":"IF(E72>0,E72-D72,0)","v":0},null,{"$f":"IF(G72=\"GUV\",K71+I72,K71)","v":0},{"$f":"L71+I72","v":0},{"$f":"IF(G72=\"GUV\",I72,\" \")","v":" "},{"$f":"IF(G72=\"GUV\",\" \",I72)","v":0}]
[{"$nulls":8},0,null,0,0," ",0]
[{"$nulls":8},0,null,0,0," ",0]
[{"$nulls":8},0,null,0,0," ",0]
[{"$nulls":8},0,null,0,0," ",0]
[{"$nulls":8},0,null,0,0," ",0]
[{"$nulls":8},0,null,0,0," ",0]
[{"$nulls":8},0,null,0,0," ",0]
[{"$nulls":8},0,null,0,0," ",0]
[{"$nulls":8},0,null,0,0," ",0]
[{"$nulls":8},0,null,0,0," ",0]
[{"$nulls":8},0,null,0,0," ",0]
[{"$nulls":8},0,null,0,0," ",0]
[{"$nulls":8},0,null,0,0," ",0]
[{"$nulls":8},0,null,0,0," ",0]
[{"$nulls":8},0,null,0,0," ",0]
[{"$nulls":8},0,null,0,0," ",0]
[{"$nulls":8},0,null,0,0," ",0]
[{"$nulls":8},0,null,0,0," ",0]
[{"$nulls":8},0,null,0,0," ",0]
[{"$nulls":8},0,null,0,0," ",0]
[{"$nulls":8},0,null,0,0," ",0]
[{"$nulls":8},0,null,0,0," ",0]
[{"$nulls":8},0,null,0,0," ",0]
[{"$nulls":8},0,null,0,0," ",0]
[{"$nulls":8},0,null,0,0," ",0]
[{"$nulls":8},0,null,0,0," ",0]
[{"$nulls":8},0,null,0,0," ",0]
[{"$nulls":8},0,null,0,0," ",0]
[{"$nulls":10},{"$f":"MAX(K6:K100)","v":0},{"$f":"MAX(L6:L100)","v":0},{"$f":"SUM(M7:M100)","v":0},{"$f":"SUM(N7:N100)","v":0}]

{"sheet":"2013","index":4,"n_rows":101,"n_cols":19,"rows_kept":101,"merged":[[0,15,0,18],[5,12,5,13]]}
[{"$nulls":15},{"$f":"C2","v":2013}]
[null,null,2013,{"$nulls":12},"Gesamt",null,"GUV"]
[{"$nulls":15},"Anzahl","hh:mm","Anzahl","hh:mm"]
[null,"Tauchgang","Datum","Einstieg","Ausstieg","Tiefe","Art","Bemerkung","Zeit",null,"GUV","Gesamt","GUV","Gesamt",null,{"$f":"COUNT(A7:A100)","v":0},{"$f":"M101+N101","v":0},{"$f":"COUNTIF(G7:G100,\"GUV\")","v":0},{"$f":"M101","v":0}]
[{"$nulls":10},"hh:mm","hh:mm"]
[{"$nulls":10},{"$f":"'2012'!$K$101","v":0},{"$f":"'2012'!$L$101","v":0},{"$f":"C2","v":2013}]
[{"$nulls":8},{"$f":"IF(E7>0,E7-D7,0)","v":0},null,{"$f":"IF(G7=\"GUV\",K6+I7,K6)","v":0},{"$f":"L6+I7","v":0},{"$f":"IF(G7=\"GUV\",I7,\" \")","v":" "},{"$f":"IF(G7=\"GUV\",\" \",I7)","v":0}]
[{"$nulls":8},{"$f":"IF(E8>0,E8-D8,0)","v":0},null,{"$f":"IF(G8=\"GUV\",K7+I8,K7)","v":0},{"$f":"L7+I8","v":0},{"$f":"IF(G8=\"GUV\",I8,\" \")","v":" "},{"$f":"IF(G8=\"GUV\",\" \",I8)","v":0}]
[{"$nulls":8},0,null,0,0," ",0]
[{"$nulls":8},0,null,0,0," ",0]
[{"$nulls":8},0,null,0,0," ",0]
[{"$nulls":8},0,null,0,0," ",0]
[{"$nulls":8},0,null,0,0," ",0]
[{"$nulls":8},0,null,0,0," ",0]
[{"$nulls":8},0,null,0,0," ",0]
[{"$nulls":8},0,null,0,0," ",0]
[{"$nulls":8},0,null,0,0," ",0]
[{"$nulls":8},0,null,0,0," ",0]
[{"$nulls":8},0,null,0,0," ",0]
[{"$nulls":8},0,null,0,0," ",0]
[{"$nulls":8},0,null,0,0," ",0]
[{"$nulls":8},0,null,0,0," ",0]
[{"$nulls":8},0,null,0,0," ",0]
[{"$nulls":8},0,null,0,0," ",0]
[{"$nulls":8},0,null,0,0," ",0]
[{"$nulls":8},0,null,0,0," ",0]
[{"$nulls":8},0,null,0,0," ",0]
[{"$nulls":8},0,null,0,0," ",0]
[{"$nulls":8},0,null,0,0," ",0]
[{"$nulls":8},0,null,0,0," ",0]
[{"$nulls":8},0,null,0,0," ",0]
[{"$nulls":8},0,null,0,0," ",0]
[{"$nulls":8},0,null,0,0," ",0]
[{"$nulls":8},0,null,0,0," ",0]
[{"$nulls":8},0,null,0,0," ",0]
[{"$nulls":8},0,null,0,0," ",0]
[{"$nulls":8},0,null,0,0," ",0]
[{"$nulls":8},0,null,0,0," ",0]
[{"$nulls":8},0,null,0,0," ",0]
[{"$nulls":8},0,null,0,0," ",0]
[{"$nulls":8},0,null,0,0," ",0]
[{"$nulls":8},0,null,0,0," ",0]
[{"$nulls":8},0,null,0,0," ",0]
[{"$nulls":8},0,null,0,0," ",0]
[{"$nulls":8},0,null,0,0," ",0]
[{"$nulls":8},0,null,0,0," ",0]
[{"$nulls":8},0,null,0,0," ",0]
[{"$nulls":8},0,null,0,0," ",0]
[{"$nulls":8},0,null,0,0," ",0]
[{"$nulls":8},0,null,0,0," ",0]
[{"$nulls":8},0,null,0,0," ",0]
[{"$nulls":8},0,null,0,0," ",0]
[{"$nulls":8},0,null,0,0," ",0]
[{"$nulls":8},0,null,0,0," ",0]
[{"$nulls":8},0,null,0,0," ",0]
[{"$nulls":8},0,null,0,0," ",0]
[{"$nulls":8},0,null,0,0," ",0]
[{"$nulls":8},0,null,0,0," ",0]
[{"$nulls":8},0,null,0,0," ",0]
[{"$nulls":8},0,null,0,0," ",0]
[{"$nulls":8},0,null,0,0," ",0]
[{"$nulls":8},0,null,0,0," ",0]
[{"$nulls":8},0,null,0,0," ",0]
[{"$nulls":8},0,null,0,0," ",0]
[{"$nulls":8},0,null,0,0," ",0]
[{"$nulls":8},0,null,0,0," ",0]
[{"$nulls":8},0,null,0,0," ",0]
[{"$nulls":8},0,null,0,0," ",0]
[{"$nulls":8},0,null,0,0," ",0]
[{"$nulls":8},0,null,0,0," ",0]
[{"$nulls":8},0,null,0,0," ",0]
[{"$nulls":8},{"$f":"IF(E72>0,E72-D72,0)","v":0},null,{"$f":"IF(G72=\"GUV\",K71+I72,K71)","v":0},{"$f":"L71+I72","v":0},{"$f":"IF(G72=\"GUV\",I72,\" \")","v":" "},{"$f":"IF(G72=\"GUV\",\" \",I72)","v":0}]
[{"$nulls":8},0,null,0,0," ",0]
[{"$nulls":8},0,null,0,0," ",0]
[{"$nulls":8},0,null,0,0," ",0]
[{"$nulls":8},0,null,0,0," ",0]
[{"$nulls":8},0,null,0,0," ",0]
[{"$nulls":8},0,null,0,0," ",0]
[{"$nulls":8},0,null,0,0," ",0]
[{"$nulls":8},0,null,0,0," ",0]
[{"$nulls":8},0,null,0,0," ",0]
[{"$nulls":8},0,null,0,0," ",0]
[{"$nulls":8},0,null,0,0," ",0]
[{"$nulls":8},0,null,0,0," ",0]
[{"$nulls":8},0,null,0,0," ",0]
[{"$nulls":8},0,null,0,0," ",0]
[{"$nulls":8},0,null,0,0," ",0]
[{"$nulls":8},0,null,0,0," ",0]
[{"$nulls":8},0,null,0,0," ",0]
[{"$nulls":8},0,null,0,0," ",0]
[{"$nulls":8},0,null,0,0," ",0]
[{"$nulls":8},0,null,0,0," ",0]
[{"$nulls":8},0,null,0,0," ",0]
[{"$nulls":8},0,null,0,0," ",0]
[{"$nulls":8},0,null,0,0," ",0]
[{"$nulls":8},0,null,0,0," ",0]
[{"$nulls":8},0,null,0,0," ",0]
[{"$nulls":8},0,null,0,0," ",0]
[{"$nulls":8},0,null,0,0," ",0]
[{"$nulls":8},0,null,0,0," ",0]
[{"$nulls":10},{"$f":"MAX(K6:K100)","v":0},{"$f":"MAX(L6:L100)","v":0},{"$f":"SUM(M7:M100)","v":0},{"$f":"SUM(N7:N100)","v":0}]

{"sheet":"2014","index":5,"n_rows":101,"n_cols":19,"rows_kept":101,"merged":[[0,15,0,18],[5,12,5,13]]}
[{"$nulls":15},{"$f":"C2","v":2014}]
[null,null,2014,{"$nulls":12},"Gesamt",null,"GUV"]
[{"$nulls":15},"Anzahl","hh:mm","Anzahl","hh:mm"]
[null,"Tauchgang","Datum","Einstieg","Ausstieg","Tiefe","Art","Bemerkung","Zeit",null,"GUV","Gesamt","GUV","Gesamt",null,{"$f":"COUNT(A7:A100)","v":0},{"$f":"M101+N101","v":0},{"$f":"COUNTIF(G7:G100,\"GUV\")","v":0},{"$f":"M101","v":0}]
[{"$nulls":10},"hh:mm","hh:mm"]
[{"$nulls":10},{"$f":"'2013'!$K$101","v":0},{"$f":"'2013'!$L$101","v":0},{"$f":"C2","v":2014}]
[{"$nulls":8},{"$f":"IF(E7>0,E7-D7,0)","v":0},null,{"$f":"IF(G7=\"GUV\",K6+I7,K6)","v":0},{"$f":"L6+I7","v":0},{"$f":"IF(G7=\"GUV\",I7,\" \")","v":" "},{"$f":"IF(G7=\"GUV\",\" \",I7)","v":0}]
[{"$nulls":8},{"$f":"IF(E8>0,E8-D8,0)","v":0},null,{"$f":"IF(G8=\"GUV\",K7+I8,K7)","v":0},{"$f":"L7+I8","v":0},{"$f":"IF(G8=\"GUV\",I8,\" \")","v":" "},{"$f":"IF(G8=\"GUV\",\" \",I8)","v":0}]
[{"$nulls":8},0,null,0,0," ",0]
[{"$nulls":8},0,null,0,0," ",0]
[{"$nulls":8},0,null,0,0," ",0]
[{"$nulls":8},0,null,0,0," ",0]
[{"$nulls":8},0,null,0,0," ",0]
[{"$nulls":8},0,null,0,0," ",0]
[{"$nulls":8},0,null,0,0," ",0]
[{"$nulls":8},0,null,0,0," ",0]
[{"$nulls":8},0,null,0,0," ",0]
[{"$nulls":8},0,null,0,0," ",0]
[{"$nulls":8},0,null,0,0," ",0]
[{"$nulls":8},0,null,0,0," ",0]
[{"$nulls":8},0,null,0,0," ",0]
[{"$nulls":8},0,null,0,0," ",0]
[{"$nulls":8},0,null,0,0," ",0]
[{"$nulls":8},0,null,0,0," ",0]
[{"$nulls":8},0,null,0,0," ",0]
[{"$nulls":8},0,null,0,0," ",0]
[{"$nulls":8},0,null,0,0," ",0]
[{"$nulls":8},0,null,0,0," ",0]
[{"$nulls":8},0,null,0,0," ",0]
[{"$nulls":8},0,null,0,0," ",0]
[{"$nulls":8},0,null,0,0," ",0]
[{"$nulls":8},0,null,0,0," ",0]
[{"$nulls":8},0,null,0,0," ",0]
[{"$nulls":8},0,null,0,0," ",0]
[{"$nulls":8},0,null,0,0," ",0]
[{"$nulls":8},0,null,0,0," ",0]
[{"$nulls":8},0,null,0,0," ",0]
[{"$nulls":8},0,null,0,0," ",0]
[{"$nulls":8},0,null,0,0," ",0]
[{"$nulls":8},0,null,0,0," ",0]
[{"$nulls":8},0,null,0,0," ",0]
[{"$nulls":8},0,null,0,0," ",0]
[{"$nulls":8},0,null,0,0," ",0]
[{"$nulls":8},0,null,0,0," ",0]
[{"$nulls":8},0,null,0,0," ",0]
[{"$nulls":8},0,null,0,0," ",0]
[{"$nulls":8},0,null,0,0," ",0]
[{"$nulls":8},0,null,0,0," ",0]
[{"$nulls":8},0,null,0,0," ",0]
[{"$nulls":8},0,null,0,0," ",0]
[{"$nulls":8},0,null,0,0," ",0]
[{"$nulls":8},0,null,0,0," ",0]
[{"$nulls":8},0,null,0,0," ",0]
[{"$nulls":8},0,null,0,0," ",0]
[{"$nulls":8},0,null,0,0," ",0]
[{"$nulls":8},0,null,0,0," ",0]
[{"$nulls":8},0,null,0,0," ",0]
[{"$nulls":8},0,null,0,0," ",0]
[{"$nulls":8},0,null,0,0," ",0]
[{"$nulls":8},0,null,0,0," ",0]
[{"$nulls":8},0,null,0,0," ",0]
[{"$nulls":8},0,null,0,0," ",0]
[{"$nulls":8},0,null,0,0," ",0]
[{"$nulls":8},0,null,0,0," ",0]
[{"$nulls":8},0,null,0,0," ",0]
[{"$nulls":8},0,null,0,0," ",0]
[{"$nulls":8},0,null,0,0," ",0]
[{"$nulls":8},0,null,0,0," ",0]
[{"$nulls":8},0,null,0,0," ",0]
[{"$nulls":8},0,null,0,0," ",0]
[{"$nulls":8},0,null,0,0," ",0]
[{"$nulls":8},{"$f":"IF(E72>0,E72-D72,0)","v":0},null,{"$f":"IF(G72=\"GUV\",K71+I72,K71)","v":0},{"$f":"L71+I72","v":0},{"$f":"IF(G72=\"GUV\",I72,\" \")","v":" "},{"$f":"IF(G72=\"GUV\",\" \",I72)","v":0}]
[{"$nulls":8},0,null,0,0," ",0]
[{"$nulls":8},0,null,0,0," ",0]
[{"$nulls":8},0,null,0,0," ",0]
[{"$nulls":8},0,null,0,0," ",0]
[{"$nulls":8},0,null,0,0," ",0]
[{"$nulls":8},0,null,0,0," ",0]
[{"$nulls":8},0,null,0,0," ",0]
[{"$nulls":8},0,null,0,0," ",0]
[{"$nulls":8},0,null,0,0," ",0]
[{"$nulls":8},0,null,0,0," ",0]
[{"$nulls":8},0,null,0,0," ",0]
[{"$nulls":8},0,null,0,0," ",0]
[{"$nulls":8},0,null,0,0," ",0]
[{"$nulls":8},0,null,0,0," ",0]
[{"$nulls":8},0,null,0,0," ",0]
[{"$nulls":8},0,null,0,0," ",0]
[{"$nulls":8},0,null,0,0," ",0]
[{"$nulls":8},0,null,0,0," ",0]
[{"$nulls":8},0,null,0,0," ",0]
[{"$nulls":8},0,null,0,0," ",0]
[{"$nulls":8},0,null,0,0," ",0]
[{"$nulls":8},0,null,0,0," ",0]
[{"$nulls":8},0,null,0,0," ",0]
[{"$nulls":8},0,null,0,0," ",0]
[{"$nulls":8},0,null,0,0," ",0]
[{"$nulls":8},0,null,0,0," ",0]
[{"$nulls":8},0,null,0,0," ",0]
[{"$nulls":8},0,null,0,0," ",0]
[{"$nulls":10},{"$f":"MAX(K6:K100)","v":0},{"$f":"MAX(L6:L100)","v":0},{"$f":"SUM(M7:M100)","v":0},{"$f":"SUM(N7:N100)","v":0}]

{"sheet":"2015","index":6,"n_rows":101,"n_cols":19,"rows_kept":101,"merged":[[0,15,0,18],[5,12,5,13]]}
[{"$nulls":15},{"$f":"C2","v":2015}]
[null,null,2015,{"$nulls":12},"Gesamt",null,"GUV"]
[{"$nulls":15},"Anzahl","hh:mm","Anzahl","hh:mm"]
[null,"Tauchgang","Datum","Einstieg","Ausstieg","Tiefe","Art","Bemerkung","Zeit",null,"GUV","Gesamt","GUV","Gesamt",null,{"$f":"COUNT(A7:A100)","v":0},{"$f":"M101+N101","v":0},{"$f":"COUNTIF(G7:G100,\"GUV\")","v":0},{"$f":"M101","v":0}]
[{"$nulls":10},"hh:mm","hh:mm"]
[{"$nulls":10},{"$f":"'2014'!$K$101","v":0},{"$f":"'2014'!$L$101","v":0},{"$f":"C2","v":2015}]
[{"$nulls":8},{"$f":"IF(E7>0,E7-D7,0)","v":0},null,{"$f":"IF(G7=\"GUV\",K6+I7,K6)","v":0},{"$f":"L6+I7","v":0},{"$f":"IF(G7=\"GUV\",I7,\" \")","v":" "},{"$f":"IF(G7=\"GUV\",\" \",I7)","v":0}]
[{"$nulls":8},{"$f":"IF(E8>0,E8-D8,0)","v":0},null,{"$f":"IF(G8=\"GUV\",K7+I8,K7)","v":0},{"$f":"L7+I8","v":0},{"$f":"IF(G8=\"GUV\",I8,\" \")","v":" "},{"$f":"IF(G8=\"GUV\",\" \",I8)","v":0}]
[{"$nulls":8},0,null,0,0," ",0]
[{"$nulls":8},0,null,0,0," ",0]
[{"$nulls":8},0,null,0,0," ",0]
[{"$nulls":8},0,null,0,0," ",0]
[{"$nulls":8},0,null,0,0," ",0]
[{"$nulls":8},0,null,0,0," ",0]
[{"$nulls":8},0,null,0,0," ",0]
[{"$nulls":8},0,null,0,0," ",0]
[{"$nulls":8},0,null,0,0," ",0]
[{"$nulls":8},0,null,0,0," ",0]
[{"$nulls":8},0,null,0,0," ",0]
[{"$nulls":8},0,null,0,0," ",0]
[{"$nulls":8},0,null,0,0," ",0]
[{"$nulls":8},0,null,0,0," ",0]
[{"$nulls":8},0,null,0,0," ",0]
[{"$nulls":8},0,null,0,0," ",0]
[{"$nulls":8},0,null,0,0," ",0]
[{"$nulls":8},0,null,0,0," ",0]
[{"$nulls":8},0,null,0,0," ",0]
[{"$nulls":8},0,null,0,0," ",0]
[{"$nulls":8},0,null,0,0," ",0]
[{"$nulls":8},0,null,0,0," ",0]
[{"$nulls":8},0,null,0,0," ",0]
[{"$nulls":8},0,null,0,0," ",0]
[{"$nulls":8},0,null,0,0," ",0]
[{"$nulls":8},0,null,0,0," ",0]
[{"$nulls":8},0,null,0,0," ",0]
[{"$nulls":8},0,null,0,0," ",0]
[{"$nulls":8},0,null,0,0," ",0]
[{"$nulls":8},0,null,0,0," ",0]
[{"$nulls":8},0,null,0,0," ",0]
[{"$nulls":8},0,null,0,0," ",0]
[{"$nulls":8},0,null,0,0," ",0]
[{"$nulls":8},0,null,0,0," ",0]
[{"$nulls":8},0,null,0,0," ",0]
[{"$nulls":8},0,null,0,0," ",0]
[{"$nulls":8},0,null,0,0," ",0]
[{"$nulls":8},0,null,0,0," ",0]
[{"$nulls":8},0,null,0,0," ",0]
[{"$nulls":8},0,null,0,0," ",0]
[{"$nulls":8},0,null,0,0," ",0]
[{"$nulls":8},0,null,0,0," ",0]
[{"$nulls":8},0,null,0,0," ",0]
[{"$nulls":8},0,null,0,0," ",0]
[{"$nulls":8},0,null,0,0," ",0]
[{"$nulls":8},0,null,0,0," ",0]
[{"$nulls":8},0,null,0,0," ",0]
[{"$nulls":8},0,null,0,0," ",0]
[{"$nulls":8},0,null,0,0," ",0]
[{"$nulls":8},0,null,0,0," ",0]
[{"$nulls":8},0,null,0,0," ",0]
[{"$nulls":8},0,null,0,0," ",0]
[{"$nulls":8},0,null,0,0," ",0]
[{"$nulls":8},0,null,0,0," ",0]
[{"$nulls":8},0,null,0,0," ",0]
[{"$nulls":8},0,null,0,0," ",0]
[{"$nulls":8},0,null,0,0," ",0]
[{"$nulls":8},0,null,0,0," ",0]
[{"$nulls":8},0,null,0,0," ",0]
[{"$nulls":8},0,null,0,0," ",0]
[{"$nulls":8},0,null,0,0," ",0]
[{"$nulls":8},0,null,0,0," ",0]
[{"$nulls":8},0,null,0,0," ",0]
[{"$nulls":8},{"$f":"IF(E72>0,E72-D72,0)","v":0},null,{"$f":"IF(G72=\"GUV\",K71+I72,K71)","v":0},{"$f":"L71+I72","v":0},{"$f":"IF(G72=\"GUV\",I72,\" \")","v":" "},{"$f":"IF(G72=\"GUV\",\" \",I72)","v":0}]
[{"$nulls":8},0,null,0,0," ",0]
[{"$nulls":8},0,null,0,0," ",0]
[{"$nulls":8},0,null,0,0," ",0]
[{"$nulls":8},0,null,0,0," ",0]
[{"$nulls":8},0,null,0,0," ",0]
[{"$nulls":8},0,null,0,0," ",0]
[{"$nulls":8},0,null,0,0," ",0]
[{"$nulls":8},0,null,0,0," ",0]
[{"$nulls":8},0,null,0,0," ",0]
[{"$nulls":8},0,null,0,0," ",0]
[{"$nulls":8},0,null,0,0," ",0]
[{"$nulls":8},0,null,0,0," ",0]
[{"$nulls":8},0,null,0,0," ",0]
[{"$nulls":8},0,null,0,0," ",0]
[{"$nulls":8},0,null,0,0," ",0]
[{"$nulls":8},0,null,0,0," ",0]
[{"$nulls":8},0,null,0,0," ",0]
[{"$nulls":8},0,null,0,0," ",0]
[{"$nulls":8},0,null,0,0," ",0]
[{"$nulls":8},0,null,0,0," ",0]
[{"$nulls":8},0,null,0,0," ",0]
[{"$nulls":8},0,null,0,0," ",0]
[{"$nulls":8},0,null,0,0," ",0]
[{"$nulls":8},0,null,0,0," ",0]
[{"$nulls":8},0,null,0,0," ",0]
[{"$nulls":8},0,null,0,0," ",0]
[{"$nulls":8},0,null,0,0," ",0]
[{"$nulls":8},0,null,0,0," ",0]
[{"$nulls":10},{"$f":"MAX(K6:K100)","v":0},{"$f":"MAX(L6:L100)","v":0},{"$f":"SUM(M7:M100)","v":0},{"$f":"SUM(N7:N100)","v":0}]

{"sheet":"2016","index":7,"n_rows":101,"n_cols":19,"rows_kept":101,"merged":[[0,15,0,18],[5,12,5,13]]}
[{"$nulls":15},{"$f":"C2","v":2016}]
[null,null,2016,{"$nulls":12},"Gesamt",null,"GUV"]
[{"$nulls":15},"Anzahl","hh:mm","Anzahl","hh:mm"]
[null,"Tauchgang","Datum","Einstieg","Ausstieg","Tiefe","Art","Bemerkung","Zeit",null,"GUV","Gesamt","GUV","Gesamt",null,{"$f":"COUNT(A7:A100)","v":0},{"$f":"M101+N101","v":0},{"$f":"COUNTIF(G7:G100,\"GUV\")","v":0},{"$f":"M101","v":0}]
[{"$nulls":10},"hh:mm","hh:mm"]
[{"$nulls":10},{"$f":"'2015'!$K$101","v":0},{"$f":"'2015'!$L$101","v":0},{"$f":"C2","v":2016}]
[{"$nulls":8},{"$f":"IF(E7>0,E7-D7,0)","v":0},null,{"$f":"IF(G7=\"GUV\",K6+I7,K6)","v":0},{"$f":"L6+I7","v":0},{"$f":"IF(G7=\"GUV\",I7,\" \")","v":" "},{"$f":"IF(G7=\"GUV\",\" \",I7)","v":0}]
[{"$nulls":8},{"$f":"IF(E8>0,E8-D8,0)","v":0},null,{"$f":"IF(G8=\"GUV\",K7+I8,K7)","v":0},{"$f":"L7+I8","v":0},{"$f":"IF(G8=\"GUV\",I8,\" \")","v":" "},{"$f":"IF(G8=\"GUV\",\" \",I8)","v":0}]
[{"$nulls":8},0,null,0,0," ",0]
[{"$nulls":8},0,null,0,0," ",0]
[{"$nulls":8},0,null,0,0," ",0]
[{"$nulls":8},0,null,0,0," ",0]
[{"$nulls":8},0,null,0,0," ",0]
[{"$nulls":8},0,null,0,0," ",0]
[{"$nulls":8},0,null,0,0," ",0]
[{"$nulls":8},0,null,0,0," ",0]
[{"$nulls":8},0,null,0,0," ",0]
[{"$nulls":8},0,null,0,0," ",0]
[{"$nulls":8},0,null,0,0," ",0]
[{"$nulls":8},0,null,0,0," ",0]
[{"$nulls":8},0,null,0,0," ",0]
[{"$nulls":8},0,null,0,0," ",0]
[{"$nulls":8},0,null,0,0," ",0]
[{"$nulls":8},0,null,0,0," ",0]
[{"$nulls":8},0,null,0,0," ",0]
[{"$nulls":8},0,null,0,0," ",0]
[{"$nulls":8},0,null,0,0," ",0]
[{"$nulls":8},0,null,0,0," ",0]
[{"$nulls":8},0,null,0,0," ",0]
[{"$nulls":8},0,null,0,0," ",0]
[{"$nulls":8},0,null,0,0," ",0]
[{"$nulls":8},0,null,0,0," ",0]
[{"$nulls":8},0,null,0,0," ",0]
[{"$nulls":8},0,null,0,0," ",0]
[{"$nulls":8},0,null,0,0," ",0]
[{"$nulls":8},0,null,0,0," ",0]
[{"$nulls":8},0,null,0,0," ",0]
[{"$nulls":8},0,null,0,0," ",0]
[{"$nulls":8},0,null,0,0," ",0]
[{"$nulls":8},0,null,0,0," ",0]
[{"$nulls":8},0,null,0,0," ",0]
[{"$nulls":8},0,null,0,0," ",0]
[{"$nulls":8},0,null,0,0," ",0]
[{"$nulls":8},0,null,0,0," ",0]
[{"$nulls":8},0,null,0,0," ",0]
[{"$nulls":8},0,null,0,0," ",0]
[{"$nulls":8},0,null,0,0," ",0]
[{"$nulls":8},0,null,0,0," ",0]
[{"$nulls":8},0,null,0,0," ",0]
[{"$nulls":8},0,null,0,0," ",0]
[{"$nulls":8},0,null,0,0," ",0]
[{"$nulls":8},0,null,0,0," ",0]
[{"$nulls":8},0,null,0,0," ",0]
[{"$nulls":8},0,null,0,0," ",0]
[{"$nulls":8},0,null,0,0," ",0]
[{"$nulls":8},0,null,0,0," ",0]
[{"$nulls":8},0,null,0,0," ",0]
[{"$nulls":8},0,null,0,0," ",0]
[{"$nulls":8},0,null,0,0," ",0]
[{"$nulls":8},0,null,0,0," ",0]
[{"$nulls":8},0,null,0,0," ",0]
[{"$nulls":8},0,null,0,0," ",0]
[{"$nulls":8},0,null,0,0," ",0]
[{"$nulls":8},0,null,0,0," ",0]
[{"$nulls":8},0,null,0,0," ",0]
[{"$nulls":8},0,null,0,0," ",0]
[{"$nulls":8},0,null,0,0," ",0]
[{"$nulls":8},0,null,0,0," ",0]
[{"$nulls":8},0,null,0,0," ",0]
[{"$nulls":8},0,null,0,0," ",0]
[{"$nulls":8},0,null,0,0," ",0]
[{"$nulls":8},{"$f":"IF(E72>0,E72-D72,0)","v":0},null,{"$f":"IF(G72=\"GUV\",K71+I72,K71)","v":0},{"$f":"L71+I72","v":0},{"$f":"IF(G72=\"GUV\",I72,\" \")","v":" "},{"$f":"IF(G72=\"GUV\",\" \",I72)","v":0}]
[{"$nulls":8},0,null,0,0," ",0]
[{"$nulls":8},0,null,0,0," ",0]
[{"$nulls":8},0,null,0,0," ",0]
[{"$nulls":8},0,null,0,0," ",0]
[{"$nulls":8},0,null,0,0," ",0]
[{"$nulls":8},0,null,0,0," ",0]
[{"$nulls":8},0,null,0,0," ",0]
[{"$nulls":8},0,null,0,0," ",0]
[{"$nulls":8},0,null,0,0," ",0]
[{"$nulls":8},0,null,0,0," ",0]
[{"$nulls":8},0,null,0,0," ",0]
[{"$nulls":8},0,null,0,0," ",0]
[{"$nulls":8},0,null,0,0," ",0]
[{"$nulls":8},0,null,0,0," ",0]
[{"$nulls":8},0,null,0,0," ",0]
[{"$nulls":8},0,null,0,0," ",0]
[{"$nulls":8},0,null,0,0," ",0]
[{"$nulls":8},0,null,0,0," ",0]
[{"$nulls":8},0,null,0,0," ",0]
[{"$nulls":8},0,null,0,0," ",0]
[{"$nulls":8},0,null,0,0," ",0]
[{"$nulls":8},0,null,0,0," ",0]
[{"$nulls":8},0,null,0,0," ",0]
[{"$nulls":8},0,null,0,0," ",0]
[{"$nulls":8},0,null,0,0," ",0]
[{"$nulls":8},0,null,0,0," ",0]
[{"$nulls":8},0,null,0,0," ",0]
[{"$nulls":8},0,null,0,0," ",0]
[{"$nulls":10},{"$f":"MAX(K6:K100)","v":0},{"$f":"MAX(L6:L100)","v":0},{"$f":"SUM(M7:M100)","v":0},{"$f":"SUM(N7:N100)","v":0}]

{"sheet":"2017","index":8,"n_rows":101,"n_cols":19,"rows_kept":101,"merged":[[0,15,0,18],[5,12,5,13]]}
[{"$nulls":15},{"$f":"C2","v":2017}]
[null,null,2017,{"$nulls":12},"Gesamt",null,"GUV"]
[{"$nulls":15},"Anzahl","hh:mm","Anzahl","hh:mm"]
[null,"Tauchgang","Datum","Einstieg","Ausstieg","Tiefe","Art","Bemerkung","Zeit",null,"GUV","Gesamt","GUV","Gesamt",null,{"$f":"COUNT(A7:A100)","v":0},{"$f":"M101+N101","v":0},{"$f":"COUNTIF(G7:G100,\"GUV\")","v":0},{"$f":"M101","v":0}]
[{"$nulls":10},"hh:mm","hh:mm"]
[{"$nulls":10},{"$f":"'2016'!$K$101","v":0},{"$f":"'2016'!$L$101","v":0},{"$f":"C2","v":2017}]
[{"$nulls":8},{"$f":"IF(E7>0,E7-D7,0)","v":0},null,{"$f":"IF(G7=\"GUV\",K6+I7,K6)","v":0},{"$f":"L6+I7","v":0},{"$f":"IF(G7=\"GUV\",I7,\" \")","v":" "},{"$f":"IF(G7=\"GUV\",\" \",I7)","v":0}]
[{"$nulls":8},{"$f":"IF(E8>0,E8-D8,0)","v":0},null,{"$f":"IF(G8=\"GUV\",K7+I8,K7)","v":0},{"$f":"L7+I8","v":0},{"$f":"IF(G8=\"GUV\",I8,\" \")","v":" "},{"$f":"IF(G8=\"GUV\",\" \",I8)","v":0}]
[{"$nulls":8},0,null,0,0," ",0]
[{"$nulls":8},0,null,0,0," ",0]
[{"$nulls":8},0,null,0,0," ",0]
[{"$nulls":8},0,null,0,0," ",0]
[{"$nulls":8},0,null,0,0," ",0]
[{"$nulls":8},0,null,0,0," ",0]
[{"$nulls":8},0,null,0,0," ",0]
[{"$nulls":8},0,null,0,0," ",0]
[{"$nulls":8},0,null,0,0," ",0]
[{"$nulls":8},0,null,0,0," ",0]
[{"$nulls":8},0,null,0,0," ",0]
[{"$nulls":8},0,null,0,0," ",0]
[{"$nulls":8},0,null,0,0," ",0]
[{"$nulls":8},0,null,0,0," ",0]
[{"$nulls":8},0,null,0,0," ",0]
[{"$nulls":8},0,null,0,0," ",0]
[{"$nulls":8},0,null,0,0," ",0]
[{"$nulls":8},0,null,0,0," ",0]
[{"$nulls":8},0,null,0,0," ",0]
[{"$nulls":8},0,null,0,0," ",0]
[{"$nulls":8},0,null,0,0," ",0]
[{"$nulls":8},0,null,0,0," ",0]
[{"$nulls":8},0,null,0,0," ",0]
[{"$nulls":8},0,null,0,0," ",0]
[{"$nulls":8},0,null,0,0," ",0]
[{"$nulls":8},0,null,0,0," ",0]
[{"$nulls":8},0,null,0,0," ",0]
[{"$nulls":8},0,null,0,0," ",0]
[{"$nulls":8},0,null,0,0," ",0]
[{"$nulls":8},0,null,0,0," ",0]
[{"$nulls":8},0,null,0,0," ",0]
[{"$nulls":8},0,null,0,0," ",0]
[{"$nulls":8},0,null,0,0," ",0]
[{"$nulls":8},0,null,0,0," ",0]
[{"$nulls":8},0,null,0,0," ",0]
[{"$nulls":8},0,null,0,0," ",0]
[{"$nulls":8},0,null,0,0," ",0]
[{"$nulls":8},0,null,0,0," ",0]
[{"$nulls":8},0,null,0,0," ",0]
[{"$nulls":8},0,null,0,0," ",0]
[{"$nulls":8},0,null,0,0," ",0]
[{"$nulls":8},0,null,0,0," ",0]
[{"$nulls":8},0,null,0,0," ",0]
[{"$nulls":8},0,null,0,0," ",0]
[{"$nulls":8},0,null,0,0," ",0]
[{"$nulls":8},0,null,0,0," ",0]
[{"$nulls":8},0,null,0,0," ",0]
[{"$nulls":8},0,null,0,0," ",0]
[{"$nulls":8},0,null,0,0," ",0]
[{"$nulls":8},0,null,0,0," ",0]
[{"$nulls":8},0,null,0,0," ",0]
[{"$nulls":8},0,null,0,0," ",0]
[{"$nulls":8},0,null,0,0," ",0]
[{"$nulls":8},0,null,0,0," ",0]
[{"$nulls":8},0,null,0,0," ",0]
[{"$nulls":8},0,null,0,0," ",0]
[{"$nulls":8},0,null,0,0," ",0]
[{"$nulls":8},0,null,0,0," ",0]
[{"$nulls":8},0,null,0,0," ",0]
[{"$nulls":8},0,null,0,0," ",0]
[{"$nulls":8},0,null,0,0," ",0]
[{"$nulls":8},0,null,0,0," ",0]
[{"$nulls":8},0,null,0,0," ",0]
[{"$nulls":8},{"$f":"IF(E72>0,E72-D72,0)","v":0},null,{"$f":"IF(G72=\"GUV\",K71+I72,K71)","v":0},{"$f":"L71+I72","v":0},{"$f":"IF(G72=\"GUV\",I72,\" \")","v":" "},{"$f":"IF(G72=\"GUV\",\" \",I72)","v":0}]
[{"$nulls":8},0,null,0,0," ",0]
[{"$nulls":8},0,null,0,0," ",0]
[{"$nulls":8},0,null,0,0," ",0]
[{"$nulls":8},0,null,0,0," ",0]
[{"$nulls":8},0,null,0,0," ",0]
[{"$nulls":8},0,null,0,0," ",0]
[{"$nulls":8},0,null,0,0," ",0]
[{"$nulls":8},0,null,0,0," ",0]
[{"$nulls":8},0,null,0,0," ",0]
[{"$nulls":8},0,null,0,0," ",0]
[{"$nulls":8},0,null,0,0," ",0]
[{"$nulls":8},0,null,0,0," ",0]
[{"$nulls":8},0,null,0,0," ",0]
[{"$nulls":8},0,null,0,0," ",0]
[{"$nulls":8},0,null,0,0," ",0]
[{"$nulls":8},0,null,0,0," ",0]
[{"$nulls":8},0,null,0,0," ",0]
[{"$nulls":8},0,null,0,0," ",0]
[{"$nulls":8},0,null,0,0," ",0]
[{"$nulls":8},0,null,0,0," ",0]
[{"$nulls":8},0,null,0,0," ",0]
[{"$nulls":8},0,null,0,0," ",0]
[{"$nulls":8},0,null,0,0," ",0]
[{"$nulls":8},0,null,0,0," ",0]
[{"$nulls":8},0,null,0,0," ",0]
[{"$nulls":8},0,null,0,0," ",0]
[{"$nulls":8},0,null,0,0," ",0]
[{"$nulls":8},0,null,0,0," ",0]
[{"$nulls":10},{"$f":"MAX(K6:K100)","v":0},{"$f":"MAX(L6:L100)","v":0},{"$f":"SUM(M7:M100)","v":0},{"$f":"SUM(N7:N100)","v":0}]

{"sheet":"2018","index":9,"n_rows":101,"n_cols":19,"rows_kept":101,"merged":[[0,15,0,18],[5,12,5,13]]}
[{"$nulls":15},{"$f":"C2","v":2018}]
[null,null,2018,{"$nulls":12},"Gesamt",null,"GUV"]
[{"$nulls":15},"Anzahl","hh:mm","Anzahl","hh:mm"]
[null,"Tauchgang","Datum","Einstieg","Ausstieg","Tiefe","Art","Bemerkung","Zeit",null,"GUV","Gesamt","GUV","Gesamt",null,{"$f":"COUNT(A7:A100)","v":0},{"$f":"M101+N101","v":0},{"$f":"COUNTIF(G7:G100,\"GUV\")","v":0},{"$f":"M101","v":0}]
[{"$nulls":10},"hh:mm","hh:mm"]
[{"$nulls":10},{"$f":"'2017'!$K$101","v":0},{"$f":"'2017'!$L$101","v":0},{"$f":"C2","v":2018}]
[{"$nulls":8},{"$f":"IF(E7>0,E7-D7,0)","v":0},null,{"$f":"IF(G7=\"GUV\",K6+I7,K6)","v":0},{"$f":"L6+I7","v":0},{"$f":"IF(G7=\"GUV\",I7,\" \")","v":" "},{"$f":"IF(G7=\"GUV\",\" \",I7)","v":0}]
[{"$nulls":8},{"$f":"IF(E8>0,E8-D8,0)","v":0},null,{"$f":"IF(G8=\"GUV\",K7+I8,K7)","v":0},{"$f":"L7+I8","v":0},{"$f":"IF(G8=\"GUV\",I8,\" \")","v":" "},{"$f":"IF(G8=\"GUV\",\" \",I8)","v":0}]
[{"$nulls":8},0,null,0,0," ",0]
[{"$nulls":8},0,null,0,0," ",0]
[{"$nulls":8},0,null,0,0," ",0]
[{"$nulls":8},0,null,0,0," ",0]
[{"$nulls":8},0,null,0,0," ",0]
[{"$nulls":8},0,null,0,0," ",0]
[{"$nulls":8},0,null,0,0," ",0]
[{"$nulls":8},0,null,0,0," ",0]
[{"$nulls":8},0,null,0,0," ",0]
[{"$nulls":8},0,null,0,0," ",0]
[{"$nulls":8},0,null,0,0," ",0]
[{"$nulls":8},0,null,0,0," ",0]
[{"$nulls":8},0,null,0,0," ",0]
[{"$nulls":8},0,null,0,0," ",0]
[{"$nulls":8},0,null,0,0," ",0]
[{"$nulls":8},0,null,0,0," ",0]
[{"$nulls":8},0,null,0,0," ",0]
[{"$nulls":8},0,null,0,0," ",0]
[{"$nulls":8},0,null,0,0," ",0]
[{"$nulls":8},0,null,0,0," ",0]
[{"$nulls":8},0,null,0,0," ",0]
[{"$nulls":8},0,null,0,0," ",0]
[{"$nulls":8},0,null,0,0," ",0]
[{"$nulls":8},0,null,0,0," ",0]
[{"$nulls":8},0,null,0,0," ",0]
[{"$nulls":8},0,null,0,0," ",0]
[{"$nulls":8},0,null,0,0," ",0]
[{"$nulls":8},0,null,0,0," ",0]
[{"$nulls":8},0,null,0,0," ",0]
[{"$nulls":8},0,null,0,0," ",0]
[{"$nulls":8},0,null,0,0," ",0]
[{"$nulls":8},0,null,0,0," ",0]
[{"$nulls":8},0,null,0,0," ",0]
[{"$nulls":8},0,null,0,0," ",0]
[{"$nulls":8},0,null,0,0," ",0]
[{"$nulls":8},0,null,0,0," ",0]
[{"$nulls":8},0,null,0,0," ",0]
[{"$nulls":8},0,null,0,0," ",0]
[{"$nulls":8},0,null,0,0," ",0]
[{"$nulls":8},0,null,0,0," ",0]
[{"$nulls":8},0,null,0,0," ",0]
[{"$nulls":8},0,null,0,0," ",0]
[{"$nulls":8},0,null,0,0," ",0]
[{"$nulls":8},0,null,0,0," ",0]
[{"$nulls":8},0,null,0,0," ",0]
[{"$nulls":8},0,null,0,0," ",0]
[{"$nulls":8},0,null,0,0," ",0]
[{"$nulls":8},0,null,0,0," ",0]
[{"$nulls":8},0,null,0,0," ",0]
[{"$nulls":8},0,null,0,0," ",0]
[{"$nulls":8},0,null,0,0," ",0]
[{"$nulls":8},0,null,0,0," ",0]
[{"$nulls":8},0,null,0,0," ",0]
[{"$nulls":8},0,null,0,0," ",0]
[{"$nulls":8},0,null,0,0," ",0]
[{"$nulls":8},0,null,0,0," ",0]
[{"$nulls":8},0,null,0,0," ",0]
[{"$nulls":8},0,null,0,0," ",0]
[{"$nulls":8},0,null,0,0," ",0]
[{"$nulls":8},0,null,0,0," ",0]
[{"$nulls":8},0,null,0,0," ",0]
[{"$nulls":8},0,null,0,0," ",0]
[{"$nulls":8},0,null,0,0," ",0]
[{"$nulls":8},{"$f":"IF(E72>0,E72-D72,0)","v":0},null,{"$f":"IF(G72=\"GUV\",K71+I72,K71)","v":0},{"$f":"L71+I72","v":0},{"$f":"IF(G72=\"GUV\",I72,\" \")","v":" "},{"$f":"IF(G72=\"GUV\",\" \",I72)","v":0}]
[{"$nulls":8},0,null,0,0," ",0]
[{"$nulls":8},0,null,0,0," ",0]
[{"$nulls":8},0,null,0,0," ",0]
[{"$nulls":8},0,null,0,0," ",0]
[{"$nulls":8},0,null,0,0," ",0]
[{"$nulls":8},0,null,0,0," ",0]
[{"$nulls":8},0,null,0,0," ",0]
[{"$nulls":8},0,null,0,0," ",0]
[{"$nulls":8},0,null,0,0," ",0]
[{"$nulls":8},0,null,0,0," ",0]
[{"$nulls":8},0,null,0,0," ",0]
[{"$nulls":8},0,null,0,0," ",0]
[{"$nulls":8},0,null,0,0," ",0]
[{"$nulls":8},0,null,0,0," ",0]
[{"$nulls":8},0,null,0,0," ",0]
[{"$nulls":8},0,null,0,0," ",0]
[{"$nulls":8},0,null,0,0," ",0]
[{"$nulls":8},0,null,0,0," ",0]
[{"$nulls":8},0,null,0,0," ",0]
[{"$nulls":8},0,null,0,0," ",0]
[{"$nulls":8},0,null,0,0," ",0]
[{"$nulls":8},0,null,0,0," ",0]
[{"$nulls":8},0,null,0,0," ",0]
[{"$nulls":8},0,null,0,0," ",0]
[{"$nulls":8},0,null,0,0," ",0]
[{"$nulls":8},0,null,0,0," ",0]
[{"$nulls":8},0,null,0,0," ",0]
[{"$nulls":8},0,null,0,0," ",0]
[{"$nulls":10},{"$f":"MAX(K6:K100)","v":0},{"$f":"MAX(L6:L100)","v":0},{"$f":"SUM(M7:M100)","v":0},{"$f":"SUM(N7:N100)","v":0}]

{"sheet":"2019","index":10,"n_rows":101,"n_cols":19,"rows_kept":101,"merged":[[0,15,0,18],[5,12,5,13]]}
[{"$nulls":15},{"$f":"C2","v":2019}]
[null,null,2019,{"$nulls":12},"Gesamt",null,"GUV"]
[{"$nulls":15},"Anzahl","hh:mm","Anzahl","hh:mm"]
[null,"Tauchgang","Datum","Einstieg","Ausstieg","Tiefe","Art","Bemerkung","Zeit",null,"GUV","Gesamt","GUV","Gesamt",null,{"$f":"COUNT(A7:A100)","v":0},{"$f":"M101+N101","v":0},{"$f":"COUNTIF(G7:G100,\"GUV\")","v":0},{"$f":"M101","v":0}]
[{"$nulls":10},"hh:mm","hh:mm"]
[{"$nulls":10},{"$f":"'2018'!$K$101","v":0},{"$f":"'2018'!$L$101","v":0},{"$f":"C2","v":2019}]
[{"$nulls":8},{"$f":"IF(E7>0,E7-D7,0)","v":0},null,{"$f":"IF(G7=\"GUV\",K6+I7,K6)","v":0},{"$f":"L6+I7","v":0},{"$f":"IF(G7=\"GUV\",I7,\" \")","v":" "},{"$f":"IF(G7=\"GUV\",\" \",I7)","v":0}]
[{"$nulls":8},{"$f":"IF(E8>0,E8-D8,0)","v":0},null,{"$f":"IF(G8=\"GUV\",K7+I8,K7)","v":0},{"$f":"L7+I8","v":0},{"$f":"IF(G8=\"GUV\",I8,\" \")","v":" "},{"$f":"IF(G8=\"GUV\",\" \",I8)","v":0}]
[{"$nulls":8},0,null,0,0," ",0]
[{"$nulls":8},0,null,0,0," ",0]
[{"$nulls":8},0,null,0,0," ",0]
[{"$nulls":8},0,null,0,0," ",0]
[{"$nulls":8},0,null,0,0," ",0]
[{"$nulls":8},0,null,0,0," ",0]
[{"$nulls":8},0,null,0,0," ",0]
[{"$nulls":8},0,null,0,0," ",0]
[{"$nulls":8},0,null,0,0," ",0]
[{"$nulls":8},0,null,0,0," ",0]
[{"$nulls":8},0,null,0,0," ",0]
[{"$nulls":8},0,null,0,0," ",0]
[{"$nulls":8},0,null,0,0," ",0]
[{"$nulls":8},0,null,0,0," ",0]
[{"$nulls":8},0,null,0,0," ",0]
[{"$nulls":8},0,null,0,0," ",0]
[{"$nulls":8},0,null,0,0," ",0]
[{"$nulls":8},0,null,0,0," ",0]
[{"$nulls":8},0,null,0,0," ",0]
[{"$nulls":8},0,null,0,0," ",0]
[{"$nulls":8},0,null,0,0," ",0]
[{"$nulls":8},0,null,0,0," ",0]
[{"$nulls":8},0,null,0,0," ",0]
[{"$nulls":8},0,null,0,0," ",0]
[{"$nulls":8},0,null,0,0," ",0]
[{"$nulls":8},0,null,0,0," ",0]
[{"$nulls":8},0,null,0,0," ",0]
[{"$nulls":8},0,null,0,0," ",0]
[{"$nulls":8},0,null,0,0," ",0]
[{"$nulls":8},0,null,0,0," ",0]
[{"$nulls":8},0,null,0,0," ",0]
[{"$nulls":8},0,null,0,0," ",0]
[{"$nulls":8},0,null,0,0," ",0]
[{"$nulls":8},0,null,0,0," ",0]
[{"$nulls":8},0,null,0,0," ",0]
[{"$nulls":8},0,null,0,0," ",0]
[{"$nulls":8},0,null,0,0," ",0]
[{"$nulls":8},0,null,0,0," ",0]
[{"$nulls":8},0,null,0,0," ",0]
[{"$nulls":8},0,null,0,0," ",0]
[{"$nulls":8},0,null,0,0," ",0]
[{"$nulls":8},0,null,0,0," ",0]
[{"$nulls":8},0,null,0,0," ",0]
[{"$nulls":8},0,null,0,0," ",0]
[{"$nulls":8},0,null,0,0," ",0]
[{"$nulls":8},0,null,0,0," ",0]
[{"$nulls":8},0,null,0,0," ",0]
[{"$nulls":8},0,null,0,0," ",0]
[{"$nulls":8},0,null,0,0," ",0]
[{"$nulls":8},0,null,0,0," ",0]
[{"$nulls":8},0,null,0,0," ",0]
[{"$nulls":8},0,null,0,0," ",0]
[{"$nulls":8},0,null,0,0," ",0]
[{"$nulls":8},0,null,0,0," ",0]
[{"$nulls":8},0,null,0,0," ",0]
[{"$nulls":8},0,null,0,0," ",0]
[{"$nulls":8},0,null,0,0," ",0]
[{"$nulls":8},0,null,0,0," ",0]
[{"$nulls":8},0,null,0,0," ",0]
[{"$nulls":8},0,null,0,0," ",0]
[{"$nulls":8},0,null,0,0," ",0]
[{"$nulls":8},0,null,0,0," ",0]
[{"$nulls":8},0,null,0,0," ",0]
[{"$nulls":8},{"$f":"IF(E72>0,E72-D72,0)","v":0},null,{"$f":"IF(G72=\"GUV\",K71+I72,K71)","v":0},{"$f":"L71+I72","v":0},{"$f":"IF(G72=\"GUV\",I72,\" \")","v":" "},{"$f":"IF(G72=\"GUV\",\" \",I72)","v":0}]
[{"$nulls":8},0,null,0,0," ",0]
[{"$nulls":8},0,null,0,0," ",0]
[{"$nulls":8},0,null,0,0," ",0]
[{"$nulls":8},0,null,0,0," ",0]
[{"$nulls":8},0,null,0,0," ",0]
[{"$nulls":8},0,null,0,0," ",0]
[{"$nulls":8},0,null,0,0," ",0]
[{"$nulls":8},0,null,0,0," ",0]
[{"$nulls":8},0,null,0,0," ",0]
[{"$nulls":8},0,null,0,0," ",0]
[{"$nulls":8},0,null,0,0," ",0]
[{"$nulls":8},0,null,0,0," ",0]
[{"$nulls":8},0,null,0,0," ",0]
[{"$nulls":8},0,null,0,0," ",0]
[{"$nulls":8},0,null,0,0," ",0]
[{"$nulls":8},0,null,0,0," ",0]
[{"$nulls":8},0,null,0,0," ",0]
[{"$nulls":8},0,null,0,0," ",0]
[{"$nulls":8},0,null,0,0," ",0]
[{"$nulls":8},0,null,0,0," ",0]
[{"$nulls":8},0,null,0,0," ",0]
[{"$nulls":8},0,null,0,0," ",0]
[{"$nulls":8},0,null,0,0," ",0]
[{"$nulls":8},0,null,0,0," ",0]
[{"$nulls":8},0,null,0,0," ",0]
[{"$nulls":8},0,null,0,0," ",0]
[{"$nulls":8},0,null,0,0," ",0]
[{"$nulls":8},0,null,0,0," ",0]
[{"$nulls":10},{"$f":"MAX(K6:K100)","v":0},{"$f":"MAX(L6:L100)","v":0},{"$f":"SUM(M7:M100)","v":0},{"$f":"SUM(N7:N100)","v":0}]

{"sheet":"2020","index":11,"n_rows":101,"n_cols":19,"rows_kept":101,"merged":[[0,15,0,18],[5,12,5,13]]}
[{"$nulls":15},{"$f":"C2","v":2020}]
[null,null,2020,{"$nulls":12},"Gesamt",null,"GUV"]
[{"$nulls":15},"Anzahl","hh:mm","Anzahl","hh:mm"]
[null,"Tauchgang","Datum","Einstieg","Ausstieg","Tiefe","Art","Bemerkung","Zeit",null,"GUV","Gesamt","GUV","Gesamt",null,{"$f":"COUNT(A7:A100)","v":0},{"$f":"M101+N101","v":0},{"$f":"COUNTIF(G7:G100,\"GUV\")","v":0},{"$f":"M101","v":0}]
[{"$nulls":10},"hh:mm","hh:mm"]
[{"$nulls":10},{"$f":"'2019'!$K$101","v":0},{"$f":"'2019'!$L$101","v":0},{"$f":"C2","v":2020}]
[{"$nulls":8},{"$f":"IF(E7>0,E7-D7,0)","v":0},null,{"$f":"IF(G7=\"GUV\",K6+I7,K6)","v":0},{"$f":"L6+I7","v":0},{"$f":"IF(G7=\"GUV\",I7,\" \")","v":" "},{"$f":"IF(G7=\"GUV\",\" \",I7)","v":0}]
[{"$nulls":8},{"$f":"IF(E8>0,E8-D8,0)","v":0},null,{"$f":"IF(G8=\"GUV\",K7+I8,K7)","v":0},{"$f":"L7+I8","v":0},{"$f":"IF(G8=\"GUV\",I8,\" \")","v":" "},{"$f":"IF(G8=\"GUV\",\" \",I8)","v":0}]
[{"$nulls":8},0,null,0,0," ",0]
[{"$nulls":8},0,null,0,0," ",0]
[{"$nulls":8},0,null,0,0," ",0]
[{"$nulls":8},0,null,0,0," ",0]
[{"$nulls":8},0,null,0,0," ",0]
[{"$nulls":8},0,null,0,0," ",0]
[{"$nulls":8},0,null,0,0," ",0]
[{"$nulls":8},0,null,0,0," ",0]
[{"$nulls":8},0,null,0,0," ",0]
[{"$nulls":8},0,null,0,0," ",0]
[{"$nulls":8},0,null,0,0," ",0]
[{"$nulls":8},0,null,0,0," ",0]
[{"$nulls":8},0,null,0,0," ",0]
[{"$nulls":8},0,null,0,0," ",0]
[{"$nulls":8},0,null,0,0," ",0]
[{"$nulls":8},0,null,0,0," ",0]
[{"$nulls":8},0,null,0,0," ",0]
[{"$nulls":8},0,null,0,0," ",0]
[{"$nulls":8},0,null,0,0," ",0]
[{"$nulls":8},0,null,0,0," ",0]
[{"$nulls":8},0,null,0,0," ",0]
[{"$nulls":8},0,null,0,0," ",0]
[{"$nulls":8},0,null,0,0," ",0]
[{"$nulls":8},0,null,0,0," ",0]
[{"$nulls":8},0,null,0,0," ",0]
[{"$nulls":8},0,null,0,0," ",0]
[{"$nulls":8},0,null,0,0," ",0]
[{"$nulls":8},0,null,0,0," ",0]
[{"$nulls":8},0,null,0,0," ",0]
[{"$nulls":8},0,null,0,0," ",0]
[{"$nulls":8},0,null,0,0," ",0]
[{"$nulls":8},0,null,0,0," ",0]
[{"$nulls":8},0,null,0,0," ",0]
[{"$nulls":8},0,null,0,0," ",0]
[{"$nulls":8},0,null,0,0," ",0]
[{"$nulls":8},0,null,0,0," ",0]
[{"$nulls":8},0,null,0,0," ",0]
[{"$nulls":8},0,null,0,0," ",0]
[{"$nulls":8},0,null,0,0," ",0]
[{"$nulls":8},0,null,0,0," ",0]
[{"$nulls":8},0,null,0,0," ",0]
[{"$nulls":8},0,null,0,0," ",0]
[{"$nulls":8},0,null,0,0," ",0]
[{"$nulls":8},0,null,0,0," ",0]
[{"$nulls":8},0,null,0,0," ",0]
[{"$nulls":8},0,null,0,0," ",0]
[{"$nulls":8},0,null,0,0," ",0]
[{"$nulls":8},0,null,0,0," ",0]
[{"$nulls":8},0,null,0,0," ",0]
[{"$nulls":8},0,null,0,0," ",0]
[{"$nulls":8},0,null,0,0," ",0]
[{"$nulls":8},0,null,0,0," ",0]
[{"$nulls":8},0,null,0,0," ",0]
[{"$nulls":8},0,null,0,0," ",0]
[{"$nulls":8},0,null,0,0," ",0]
[{"$nulls":8},0,null,0,0," ",0]
[{"$nulls":8},0,null,0,0," ",0]
[{"$nulls":8},0,null,0,0," ",0]
[{"$nulls":8},0,null,0,0," ",0]
[{"$nulls":8},0,null,0,0," ",0]
[{"$nulls":8},0,null,0,0," ",0]
[{"$nulls":8},0,null,0,0," ",0]
[{"$nulls":8},0,null,0,0," ",0]
[{"$nulls":8},{"$f":"IF(E72>0,E72-D72,0)","v":0},null,{"$f":"IF(G72=\"GUV\",K71+I72,K71)","v":0},{"$f":"L71+I72","v":0},{"$f":"IF(G72=\"GUV\",I72,\" \")","v":" "},{"$f":"IF(G72=\"GUV\",\" \",I72)","v":0}]
[{"$nulls":8},0,null,0,0," ",0]
[{"$nulls":8},0,null,0,0," ",0]
[{"$nulls":8},0,null,0,0," ",0]
[{"$nulls":8},0,null,0,0," ",0]
[{"$nulls":8},0,null,0,0," ",0]
[{"$nulls":8},0,null,0,0," ",0]
[{"$nulls":8},0,null,0,0," ",0]
[{"$nulls":8},0,null,0,0," ",0]
[{"$nulls":8},0,null,0,0," ",0]
[{"$nulls":8},0,null,0,0," ",0]
[{"$nulls":8},0,null,0,0," ",0]
[{"$nulls":8},0,null,0,0," ",0]
[{"$nulls":8},0,null,0,0," ",0]
[{"$nulls":8},0,null,0,0," ",0]
[{"$nulls":8},0,null,0,0," ",0]
[{"$nulls":8},0,null,0,0," ",0]
[{"$nulls":8},0,null,0,0," ",0]
[{"$nulls":8},0,null,0,0," ",0]
[{"$nulls":8},0,null,0,0," ",0]
[{"$nulls":8},0,null,0,0," ",0]
[{"$nulls":8},0,null,0,0," ",0]
[{"$nulls":8},0,null,0,0," ",0]
[{"$nulls":8},0,null,0,0," ",0]
[{"$nulls":8},0,null,0,0," ",0]
[{"$nulls":8},0,null,0,0," ",0]
[{"$nulls":8},0,null,0,0," ",0]
[{"$nulls":8},0,null,0,0," ",0]
[{"$nulls":8},0,null,0,0," ",0]
[{"$nulls":10},{"$f":"MAX(K6:K100)","v":0},{"$f":"MAX(L6:L100)","v":0},{"$f":"SUM(M7:M100)","v":0},{"$f":"SUM(N7:N100)","v":0}]

{"sheet":"2021","index":12,"n_rows":101,"n_cols":19,"rows_kept":101,"merged":[[0,15,0,18],[5,12,5,13]]}
[{"$nulls":15},{"$f":"C2","v":2021}]
[null,null,2021,{"$nulls":12},"Gesamt",null,"GUV"]
[{"$nulls":15},"Anzahl","hh:mm","Anzahl","hh:mm"]
[null,"Tauchgang","Datum","Einstieg","Ausstieg","Tiefe","Art","Bemerkung","Zeit",null,"GUV","Gesamt","GUV","Gesamt",null,{"$f":"COUNT(A7:A100)","v":0},{"$f":"M101+N101","v":0},{"$f":"COUNTIF(G7:G100,\"GUV\")","v":0},{"$f":"M101","v":0}]
[{"$nulls":10},"hh:mm","hh:mm"]
[{"$nulls":10},{"$f":"'2020'!$K$101","v":0},{"$f":"'2020'!$L$101","v":0},{"$f":"C2","v":2021}]
[{"$nulls":8},{"$f":"IF(E7>0,E7-D7,0)","v":0},null,{"$f":"IF(G7=\"GUV\",K6+I7,K6)","v":0},{"$f":"L6+I7","v":0},{"$f":"IF(G7=\"GUV\",I7,\" \")","v":" "},{"$f":"IF(G7=\"GUV\",\" \",I7)","v":0}]
[{"$nulls":8},{"$f":"IF(E8>0,E8-D8,0)","v":0},null,{"$f":"IF(G8=\"GUV\",K7+I8,K7)","v":0},{"$f":"L7+I8","v":0},{"$f":"IF(G8=\"GUV\",I8,\" \")","v":" "},{"$f":"IF(G8=\"GUV\",\" \",I8)","v":0}]
[{"$nulls":8},0,null,0,0," ",0]
[{"$nulls":8},0,null,0,0," ",0]
[{"$nulls":8},0,null,0,0," ",0]
[{"$nulls":8},0,null,0,0," ",0]
[{"$nulls":8},0,null,0,0," ",0]
[{"$nulls":8},0,null,0,0," ",0]
[{"$nulls":8},0,null,0,0," ",0]
[{"$nulls":8},0,null,0,0," ",0]
[{"$nulls":8},0,null,0,0," ",0]
[{"$nulls":8},0,null,0,0," ",0]
[{"$nulls":8},0,null,0,0," ",0]
[{"$nulls":8},0,null,0,0," ",0]
[{"$nulls":8},0,null,0,0," ",0]
[{"$nulls":8},0,null,0,0," ",0]
[{"$nulls":8},0,null,0,0," ",0]
[{"$nulls":8},0,null,0,0," ",0]
[{"$nulls":8},0,null,0,0," ",0]
[{"$nulls":8},0,null,0,0," ",0]
[{"$nulls":8},0,null,0,0," ",0]
[{"$nulls":8},0,null,0,0," ",0]
[{"$nulls":8},0,null,0,0," ",0]
[{"$nulls":8},0,null,0,0," ",0]
[{"$nulls":8},0,null,0,0," ",0]
[{"$nulls":8},0,null,0,0," ",0]
[{"$nulls":8},0,null,0,0," ",0]
[{"$nulls":8},0,null,0,0," ",0]
[{"$nulls":8},0,null,0,0," ",0]
[{"$nulls":8},0,null,0,0," ",0]
[{"$nulls":8},0,null,0,0," ",0]
[{"$nulls":8},0,null,0,0," ",0]
[{"$nulls":8},0,null,0,0," ",0]
[{"$nulls":8},0,null,0,0," ",0]
[{"$nulls":8},0,null,0,0," ",0]
[{"$nulls":8},0,null,0,0," ",0]
[{"$nulls":8},0,null,0,0," ",0]
[{"$nulls":8},0,null,0,0," ",0]
[{"$nulls":8},0,null,0,0," ",0]
[{"$nulls":8},0,null,0,0," ",0]
[{"$nulls":8},0,null,0,0," ",0]
[{"$nulls":8},0,null,0,0," ",0]
[{"$nulls":8},0,null,0,0," ",0]
[{"$nulls":8},0,null,0,0," ",0]
[{"$nulls":8},0,null,0,0," ",0]
[{"$nulls":8},0,null,0,0," ",0]
[{"$nulls":8},0,null,0,0," ",0]
[{"$nulls":8},0,null,0,0," ",0]
[{"$nulls":8},0,null,0,0," ",0]
[{"$nulls":8},0,null,0,0," ",0]
[{"$nulls":8},0,null,0,0," ",0]
[{"$nulls":8},0,null,0,0," ",0]
[{"$nulls":8},0,null,0,0," ",0]
[{"$nulls":8},0,null,0,0," ",0]
[{"$nulls":8},0,null,0,0," ",0]
[{"$nulls":8},0,null,0,0," ",0]
[{"$nulls":8},0,null,0,0," ",0]
[{"$nulls":8},0,null,0,0," ",0]
[{"$nulls":8},0,null,0,0," ",0]
[{"$nulls":8},0,null,0,0," ",0]
[{"$nulls":8},0,null,0,0," ",0]
[{"$nulls":8},0,null,0,0," ",0]
[{"$nulls":8},0,null,0,0," ",0]
[{"$nulls":8},0,null,0,0," ",0]
[{"$nulls":8},0,null,0,0," ",0]
[{"$nulls":8},{"$f":"IF(E72>0,E72-D72,0)","v":0},null,{"$f":"IF(G72=\"GUV\",K71+I72,K71)","v":0},{"$f":"L71+I72","v":0},{"$f":"IF(G72=\"GUV\",I72,\" \")","v":" "},{"$f":"IF(G72=\"GUV\",\" \",I72)","v":0}]
[{"$nulls":8},0,null,0,0," ",0]
[{"$nulls":8},0,null,0,0," ",0]
[{"$nulls":8},0,null,0,0," ",0]
[{"$nulls":8},0,null,0,0," ",0]
[{"$nulls":8},0,null,0,0," ",0]
[{"$nulls":8},0,null,0,0," ",0]
[{"$nulls":8},0,null,0,0," ",0]
[{"$nulls":8},0,null,0,0," ",0]
[{"$nulls":8},0,null,0,0," ",0]
[{"$nulls":8},0,null,0,0," ",0]
[{"$nulls":8},0,null,0,0," ",0]
[{"$nulls":8},0,null,0,0," ",0]
[{"$nulls":8},0,null,0,0," ",0]
[{"$nulls":8},0,null,0,0," ",0]
[{"$nulls":8},0,null,0,0," ",0]
[{"$nulls":8},0,null,0,0," ",0]
[{"$nulls":8},0,null,0,0," ",0]
[{"$nulls":8},0,null,0,0," ",0]
[{"$nulls":8},0,null,0,0," ",0]
[{"$nulls":8},0,null,0,0," ",0]
[{"$nulls":8},0,null,0,0," ",0]
[{"$nulls":8},0,null,0,0," ",0]
[{"$nulls":8},0,null,0,0," ",0]
[{"$nulls":8},0,null,0,0," ",0]
[{"$nulls":8},0,null,0,0," ",0]
[{"$nulls":8},0,null,0,0," ",0]
[{"$nulls":8},0,null,0,0," ",0]
[{"$nulls":8},0,null,0,0," ",0]
[{"$nulls":10},{"$f":"MAX(K6:K100)","v":0},{"$f":"MAX(L6:L100)","v":0},{"$f":"SUM(M7:M100)","v":0},{"$f":"SUM(N7:N100)","v":0}]

{"sheet":"2022","index":13,"n_rows":101,"n_cols":19,"rows_kept":101,"merged":[[0,15,0,18],[5,12,5,13]]}
[{"$nulls":15},{"$f":"C2","v":2022}]
[null,null,2022,{"$nulls":12},"Gesamt",null,"GUV"]
[{"$nulls":15},"Anzahl","hh:mm","Anzahl","hh:mm"]
[null,"Tauchgang","Datum","Einstieg","Ausstieg","Tiefe","Art","Bemerkung","Zeit",null,"GUV","Gesamt","GUV","Gesamt",null,{"$f":"COUNT(A7:A100)","v":0},{"$f":"M101+N101","v":0},{"$f":"COUNTIF(G7:G100,\"GUV\")","v":0},{"$f":"M101","v":0}]
[{"$nulls":10},"hh:mm","hh:mm"]
[{"$nulls":10},{"$f":"'2021'!$K$101","v":0},{"$f":"'2021'!$L$101","v":0},{"$f":"C2","v":2022}]
[{"$nulls":8},{"$f":"IF(E7>0,E7-D7,0)","v":0},null,{"$f":"IF(G7=\"GUV\",K6+I7,K6)","v":0},{"$f":"L6+I7","v":0},{"$f":"IF(G7=\"GUV\",I7,\" \")","v":" "},{"$f":"IF(G7=\"GUV\",\" \",I7)","v":0}]
[{"$nulls":8},{"$f":"IF(E8>0,E8-D8,0)","v":0},null,{"$f":"IF(G8=\"GUV\",K7+I8,K7)","v":0},{"$f":"L7+I8","v":0},{"$f":"IF(G8=\"GUV\",I8,\" \")","v":" "},{"$f":"IF(G8=\"GUV\",\" \",I8)","v":0}]
[{"$nulls":8},0,null,0,0," ",0]
[{"$nulls":8},0,null,0,0," ",0]
[{"$nulls":8},0,null,0,0," ",0]
[{"$nulls":8},0,null,0,0," ",0]
[{"$nulls":8},0,null,0,0," ",0]
[{"$nulls":8},0,null,0,0," ",0]
[{"$nulls":8},0,null,0,0," ",0]
[{"$nulls":8},0,null,0,0," ",0]
[{"$nulls":8},0,null,0,0," ",0]
[{"$nulls":8},0,null,0,0," ",0]
[{"$nulls":8},0,null,0,0," ",0]
[{"$nulls":8},0,null,0,0," ",0]
[{"$nulls":8},0,null,0,0," ",0]
[{"$nulls":8},0,null,0,0," ",0]
[{"$nulls":8},0,null,0,0," ",0]
[{"$nulls":8},0,null,0,0," ",0]
[{"$nulls":8},0,null,0,0," ",0]
[{"$nulls":8},0,null,0,0," ",0]
[{"$nulls":8},0,null,0,0," ",0]
[{"$nulls":8},0,null,0,0," ",0]
[{"$nulls":8},0,null,0,0," ",0]
[{"$nulls":8},0,null,0,0," ",0]
[{"$nulls":8},0,null,0,0," ",0]
[{"$nulls":8},0,null,0,0," ",0]
[{"$nulls":8},0,null,0,0," ",0]
[{"$nulls":8},0,null,0,0," ",0]
[{"$nulls":8},0,null,0,0," ",0]
[{"$nulls":8},0,null,0,0," ",0]
[{"$nulls":8},0,null,0,0," ",0]
[{"$nulls":8},0,null,0,0," ",0]
[{"$nulls":8},0,null,0,0," ",0]
[{"$nulls":8},0,null,0,0," ",0]
[{"$nulls":8},0,null,0,0," ",0]
[{"$nulls":8},0,null,0,0," ",0]
[{"$nulls":8},0,null,0,0," ",0]
[{"$nulls":8},0,null,0,0," ",0]
[{"$nulls":8},0,null,0,0," ",0]
[{"$nulls":8},0,null,0,0," ",0]
[{"$nulls":8},0,null,0,0," ",0]
[{"$nulls":8},0,null,0,0," ",0]
[{"$nulls":8},0,null,0,0," ",0]
[{"$nulls":8},0,null,0,0," ",0]
[{"$nulls":8},0,null,0,0," ",0]
[{"$nulls":8},0,null,0,0," ",0]
[{"$nulls":8},0,null,0,0," ",0]
[{"$nulls":8},0,null,0,0," ",0]
[{"$nulls":8},0,null,0,0," ",0]
[{"$nulls":8},0,null,0,0," ",0]
[{"$nulls":8},0,null,0,0," ",0]
[{"$nulls":8},0,null,0,0," ",0]
[{"$nulls":8},0,null,0,0," ",0]
[{"$nulls":8},0,null,0,0," ",0]
[{"$nulls":8},0,null,0,0," ",0]
[{"$nulls":8},0,null,0,0," ",0]
[{"$nulls":8},0,null,0,0," ",0]
[{"$nulls":8},0,null,0,0," ",0]
[{"$nulls":8},0,null,0,0," ",0]
[{"$nulls":8},0,null,0,0," ",0]
[{"$nulls":8},0,null,0,0," ",0]
[{"$nulls":8},0,null,0,0," ",0]
[{"$nulls":8},0,null,0,0," ",0]
[{"$nulls":8},0,null,0,0," ",0]
[{"$nulls":8},0,null,0,0," ",0]
[{"$nulls":8},{"$f":"IF(E72>0,E72-D72,0)","v":0},null,{"$f":"IF(G72=\"GUV\",K71+I72,K71)","v":0},{"$f":"L71+I72","v":0},{"$f":"IF(G72=\"GUV\",I72,\" \")","v":" "},{"$f":"IF(G72=\"GUV\",\" \",I72)","v":0}]
[{"$nulls":8},0,null,0,0," ",0]
[{"$nulls":8},0,null,0,0," ",0]
[{"$nulls":8},0,null,0,0," ",0]
[{"$nulls":8},0,null,0,0," ",0]
[{"$nulls":8},0,null,0,0," ",0]
[{"$nulls":8},0,null,0,0," ",0]
[{"$nulls":8},0,null,0,0," ",0]
[{"$nulls":8},0,null,0,0," ",0]
[{"$nulls":8},0,null,0,0," ",0]
[{"$nulls":8},0,null,0,0," ",0]
[{"$nulls":8},0,null,0,0," ",0]
[{"$nulls":8},0,null,0,0," ",0]
[{"$nulls":8},0,null,0,0," ",0]
[{"$nulls":8},0,null,0,0," ",0]
[{"$nulls":8},0,null,0,0," ",0]
[{"$nulls":8},0,null,0,0," ",0]
[{"$nulls":8},0,null,0,0," ",0]
[{"$nulls":8},0,null,0,0," ",0]
[{"$nulls":8},0,null,0,0," ",0]
[{"$nulls":8},0,null,0,0," ",0]
[{"$nulls":8},0,null,0,0," ",0]
[{"$nulls":8},0,null,0,0," ",0]
[{"$nulls":8},0,null,0,0," ",0]
[{"$nulls":8},0,null,0,0," ",0]
[{"$nulls":8},0,null,0,0," ",0]
[{"$nulls":8},0,null,0,0," ",0]
[{"$nulls":8},0,null,0,0," ",0]
[{"$nulls":8},0,null,0,0," ",0]
[{"$nulls":10},{"$f":"MAX(K6:K100)","v":0},{"$f":"MAX(L6:L100)","v":0},{"$f":"SUM(M7:M100)","v":0},{"$f":"SUM(N7:N100)","v":0}]

{"sheet":"2023","index":14,"n_rows":101,"n_cols":19,"rows_kept":101,"merged":[[0,15,0,18],[5,12,5,13]]}
[{"$nulls":15},{"$f":"C2","v":2023}]
[null,null,2023,{"$nulls":12},"Gesamt",null,"GUV"]
[{"$nulls":15},"Anzahl","hh:mm","Anzahl","hh:mm"]
[null,"Tauchgang","Datum","Einstieg","Ausstieg","Tiefe","Art","Bemerkung","Zeit",null,"GUV","Gesamt","GUV","Gesamt",null,{"$f":"COUNT(A7:A100)","v":0},{"$f":"M101+N101","v":0},{"$f":"COUNTIF(G7:G100,\"GUV\")","v":0},{"$f":"M101","v":0}]
[{"$nulls":10},"hh:mm","hh:mm"]
[{"$nulls":10},{"$f":"'2022'!$K$101","v":0},{"$f":"'2022'!$L$101","v":0},{"$f":"C2","v":2023}]
[{"$nulls":8},{"$f":"IF(E7>0,E7-D7,0)","v":0},null,{"$f":"IF(G7=\"GUV\",K6+I7,K6)","v":0},{"$f":"L6+I7","v":0},{"$f":"IF(G7=\"GUV\",I7,\" \")","v":" "},{"$f":"IF(G7=\"GUV\",\" \",I7)","v":0}]
[{"$nulls":8},{"$f":"IF(E8>0,E8-D8,0)","v":0},null,{"$f":"IF(G8=\"GUV\",K7+I8,K7)","v":0},{"$f":"L7+I8","v":0},{"$f":"IF(G8=\"GUV\",I8,\" \")","v":" "},{"$f":"IF(G8=\"GUV\",\" \",I8)","v":0}]
[{"$nulls":8},0,null,0,0," ",0]
[{"$nulls":8},0,null,0,0," ",0]
[{"$nulls":8},0,null,0,0," ",0]
[{"$nulls":8},0,null,0,0," ",0]
[{"$nulls":8},0,null,0,0," ",0]
[{"$nulls":8},0,null,0,0," ",0]
[{"$nulls":8},0,null,0,0," ",0]
[{"$nulls":8},0,null,0,0," ",0]
[{"$nulls":8},0,null,0,0," ",0]
[{"$nulls":8},0,null,0,0," ",0]
[{"$nulls":8},0,null,0,0," ",0]
[{"$nulls":8},0,null,0,0," ",0]
[{"$nulls":8},0,null,0,0," ",0]
[{"$nulls":8},0,null,0,0," ",0]
[{"$nulls":8},0,null,0,0," ",0]
[{"$nulls":8},0,null,0,0," ",0]
[{"$nulls":8},0,null,0,0," ",0]
[{"$nulls":8},0,null,0,0," ",0]
[{"$nulls":8},0,null,0,0," ",0]
[{"$nulls":8},0,null,0,0," ",0]
[{"$nulls":8},0,null,0,0," ",0]
[{"$nulls":8},0,null,0,0," ",0]
[{"$nulls":8},0,null,0,0," ",0]
[{"$nulls":8},0,null,0,0," ",0]
[{"$nulls":8},0,null,0,0," ",0]
[{"$nulls":8},0,null,0,0," ",0]
[{"$nulls":8},0,null,0,0," ",0]
[{"$nulls":8},0,null,0,0," ",0]
[{"$nulls":8},0,null,0,0," ",0]
[{"$nulls":8},0,null,0,0," ",0]
[{"$nulls":8},0,null,0,0," ",0]
[{"$nulls":8},0,null,0,0," ",0]
[{"$nulls":8},0,null,0,0," ",0]
[{"$nulls":8},0,null,0,0," ",0]
[{"$nulls":8},0,null,0,0," ",0]
[{"$nulls":8},0,null,0,0," ",0]
[{"$nulls":8},0,null,0,0," ",0]
[{"$nulls":8},0,null,0,0," ",0]
[{"$nulls":8},0,null,0,0," ",0]
[{"$nulls":8},0,null,0,0," ",0]
[{"$nulls":8},0,null,0,0," ",0]
[{"$nulls":8},0,null,0,0," ",0]
[{"$nulls":8},0,null,0,0," ",0]
[{"$nulls":8},0,null,0,0," ",0]
[{"$nulls":8},0,null,0,0," ",0]
[{"$nulls":8},0,null,0,0," ",0]
[{"$nulls":8},0,null,0,0," ",0]
[{"$nulls":8},0,null,0,0," ",0]
[{"$nulls":8},0,null,0,0," ",0]
[{"$nulls":8},0,null,0,0," ",0]
[{"$nulls":8},0,null,0,0," ",0]
[{"$nulls":8},0,null,0,0," ",0]
[{"$nulls":8},0,null,0,0," ",0]
[{"$nulls":8},0,null,0,0," ",0]
[{"$nulls":8},0,null,0,0," ",0]
[{"$nulls":8},0,null,0,0," ",0]
[{"$nulls":8},0,null,0,0," ",0]
[{"$nulls":8},0,null,0,0," ",0]
[{"$nulls":8},0,null,0,0," ",0]
[{"$nulls":8},0,null,0,0," ",0]
[{"$nulls":8},0,null,0,0," ",0]
[{"$nulls":8},0,null,0,0," ",0]
[{"$nulls":8},0,null,0,0," ",0]
[{"$nulls":8},{"$f":"IF(E72>0,E72-D72,0)","v":0},null,{"$f":"IF(G72=\"GUV\",K71+I72,K71)","v":0},{"$f":"L71+I72","v":0},{"$f":"IF(G72=\"GUV\",I72,\" \")","v":" "},{"$f":"IF(G72=\"GUV\",\" \",I72)","v":0}]
[{"$nulls":8},0,null,0,0," ",0]
[{"$nulls":8},0,null,0,0," ",0]
[{"$nulls":8},0,null,0,0," ",0]
[{"$nulls":8},0,null,0,0," ",0]
[{"$nulls":8},0,null,0,0," ",0]
[{"$nulls":8},0,null,0,0," ",0]
[{"$nulls":8},0,null,0,0," ",0]
[{"$nulls":8},0,null,0,0," ",0]
[{"$nulls":8},0,null,0,0," ",0]
[{"$nulls":8},0,null,0,0," ",0]
[{"$nulls":8},0,null,0,0," ",0]
[{"$nulls":8},0,null,0,0," ",0]
[{"$nulls":8},0,null,0,0," ",0]
[{"$nulls":8},0,null,0,0," ",0]
[{"$nulls":8},0,null,0,0," ",0]
[{"$nulls":8},0,null,0,0," ",0]
[{"$nulls":8},0,null,0,0," ",0]
[{"$nulls":8},0,null,0,0," ",0]
[{"$nulls":8},0,null,0,0," ",0]
[{"$nulls":8},0,null,0,0," ",0]
[{"$nulls":8},0,null,0,0," ",0]
[{"$nulls":8},0,null,0,0," ",0]
[{"$nulls":8},0,null,0,0," ",0]
[{"$nulls":8},0,null,0,0," ",0]
[{"$nulls":8},0,null,0,0," ",0]
[{"$nulls":8},0,null,0,0," ",0]
[{"$nulls":8},0,null,0,0," ",0]
[{"$nulls":8},0,null,0,0," ",0]
[{"$nulls":10},{"$f":"MAX(K6:K100)","v":0},{"$f":"MAX(L6:L100)","v":0},{"$f":"SUM(M7:M100)","v":0},{"$f":"SUM(N7:N100)","v":0}]

{"sheet":"2024","index":15,"n_rows":101,"n_cols":19,"rows_kept":101,"merged":[[0,15,0,18],[5,12,5,13]]}
[{"$nulls":15},{"$f":"C2","v":2024}]
[null,null,2024,{"$nulls":12},"Gesamt",null,"GUV"]
[{"$nulls":15},"Anzahl","hh:mm","Anzahl","hh:mm"]
[null,"Tauchgang","Datum","Einstieg","Ausstieg","Tiefe","Art","Bemerkung","Zeit",null,"GUV","Gesamt","GUV","Gesamt",null,{"$f":"COUNT(A7:A100)","v":0},{"$f":"M101+N101","v":0},{"$f":"COUNTIF(G7:G100,\"GUV\")","v":0},{"$f":"M101","v":0}]
[{"$nulls":10},"hh:mm","hh:mm"]
[{"$nulls":10},{"$f":"'2023'!$K$101","v":0},{"$f":"'2023'!$L$101","v":0},{"$f":"C2","v":2024}]
[{"$nulls":8},{"$f":"IF(E7>0,E7-D7,0)","v":0},null,{"$f":"IF(G7=\"GUV\",K6+I7,K6)","v":0},{"$f":"L6+I7","v":0},{"$f":"IF(G7=\"GUV\",I7,\" \")","v":" "},{"$f":"IF(G7=\"GUV\",\" \",I7)","v":0}]
[{"$nulls":8},{"$f":"IF(E8>0,E8-D8,0)","v":0},null,{"$f":"IF(G8=\"GUV\",K7+I8,K7)","v":0},{"$f":"L7+I8","v":0},{"$f":"IF(G8=\"GUV\",I8,\" \")","v":" "},{"$f":"IF(G8=\"GUV\",\" \",I8)","v":0}]
[{"$nulls":8},0,null,0,0," ",0]
[{"$nulls":8},0,null,0,0," ",0]
[{"$nulls":8},0,null,0,0," ",0]
[{"$nulls":8},0,null,0,0," ",0]
[{"$nulls":8},0,null,0,0," ",0]
[{"$nulls":8},0,null,0,0," ",0]
[{"$nulls":8},0,null,0,0," ",0]
[{"$nulls":8},0,null,0,0," ",0]
[{"$nulls":8},0,null,0,0," ",0]
[{"$nulls":8},0,null,0,0," ",0]
[{"$nulls":8},0,null,0,0," ",0]
[{"$nulls":8},0,null,0,0," ",0]
[{"$nulls":8},0,null,0,0," ",0]
[{"$nulls":8},0,null,0,0," ",0]
[{"$nulls":8},0,null,0,0," ",0]
[{"$nulls":8},0,null,0,0," ",0]
[{"$nulls":8},0,null,0,0," ",0]
[{"$nulls":8},0,null,0,0," ",0]
[{"$nulls":8},0,null,0,0," ",0]
[{"$nulls":8},0,null,0,0," ",0]
[{"$nulls":8},0,null,0,0," ",0]
[{"$nulls":8},0,null,0,0," ",0]
[{"$nulls":8},0,null,0,0," ",0]
[{"$nulls":8},0,null,0,0," ",0]
[{"$nulls":8},0,null,0,0," ",0]
[{"$nulls":8},0,null,0,0," ",0]
[{"$nulls":8},0,null,0,0," ",0]
[{"$nulls":8},0,null,0,0," ",0]
[{"$nulls":8},0,null,0,0," ",0]
[{"$nulls":8},0,null,0,0," ",0]
[{"$nulls":8},0,null,0,0," ",0]
[{"$nulls":8},0,null,0,0," ",0]
[{"$nulls":8},0,null,0,0," ",0]
[{"$nulls":8},0,null,0,0," ",0]
[{"$nulls":8},0,null,0,0," ",0]
[{"$nulls":8},0,null,0,0," ",0]
[{"$nulls":8},0,null,0,0," ",0]
[{"$nulls":8},0,null,0,0," ",0]
[{"$nulls":8},0,null,0,0," ",0]
[{"$nulls":8},0,null,0,0," ",0]
[{"$nulls":8},0,null,0,0," ",0]
[{"$nulls":8},0,null,0,0," ",0]
[{"$nulls":8},0,null,0,0," ",0]
[{"$nulls":8},0,null,0,0," ",0]
[{"$nulls":8},0,null,0,0," ",0]
[{"$nulls":8},0,null,0,0," ",0]
[{"$nulls":8},0,null,0,0," ",0]
[{"$nulls":8},0,null,0,0," ",0]
[{"$nulls":8},0,null,0,0," ",0]
[{"$nulls":8},0,null,0,0," ",0]
[{"$nulls":8},0,null,0,0," ",0]
[{"$nulls":8},0,null,0,0," ",0]
[{"$nulls":8},0,null,0,0," ",0]
[{"$nulls":8},0,null,0,0," ",0]
[{"$nulls":8},0,null,0,0," ",0]
[{"$nulls":8},0,null,0,0," ",0]
[{"$nulls":8},0,null,0,0," ",0]
[{"$nulls":8},0,null,0,0," ",0]
[{"$nulls":8},0,null,0,0," ",0]
[{"$nulls":8},0,null,0,0," ",0]
[{"$nulls":8},0,null,0,0," ",0]
[{"$nulls":8},0,null,0,0," ",0]
[{"$nulls":8},0,null,0,0," ",0]
[{"$nulls":8},{"$f":"IF(E72>0,E72-D72,0)","v":0},null,{"$f":"IF(G72=\"GUV\",K71+I72,K71)","v":0},{"$f":"L71+I72","v":0},{"$f":"IF(G72=\"GUV\",I72,\" \")","v":" "},{"$f":"IF(G72=\"GUV\",\" \",I72)","v":0}]
[{"$nulls":8},0,null,0,0," ",0]
[{"$nulls":8},0,null,0,0," ",0]
[{"$nulls":8},0,null,0,0," ",0]
[{"$nulls":8},0,null,0,0," ",0]
[{"$nulls":8},0,null,0,0," ",0]
[{"$nulls":8},0,null,0,0," ",0]
[{"$nulls":8},0,null,0,0," ",0]
[{"$nulls":8},0,null,0,0," ",0]
[{"$nulls":8},0,null,0,0," ",0]
[{"$nulls":8},0,null,0,0," ",0]
[{"$nulls":8},0,null,0,0," ",0]
[{"$nulls":8},0,null,0,0," ",0]
[{"$nulls":8},0,null,0,0," ",0]
[{"$nulls":8},0,null,0,0," ",0]
[{"$nulls":8},0,null,0,0," ",0]
[{"$nulls":8},0,null,0,0," ",0]
[{"$nulls":8},0,null,0,0," ",0]
[{"$nulls":8},0,null,0,0," ",0]
[{"$nulls":8},0,null,0,0," ",0]
[{"$nulls":8},0,null,0,0," ",0]
[{"$nulls":8},0,null,0,0," ",0]
[{"$nulls":8},0,null,0,0," ",0]
[{"$nulls":8},0,null,0,0," ",0]
[{"$nulls":8},0,null,0,0," ",0]
[{"$nulls":8},0,null,0,0," ",0]
[{"$nulls":8},0,null,0,0," ",0]
[{"$nulls":8},0,null,0,0," ",0]
[{"$nulls":8},0,null,0,0," ",0]
[{"$nulls":10},{"$f":"MAX(K6:K100)","v":0},{"$f":"MAX(L6:L100)","v":0},{"$f":"SUM(M7:M100)","v":0},{"$f":"SUM(N7:N100)","v":0}]

{"sheet":"2025","index":16,"n_rows":101,"n_cols":19,"rows_kept":101,"merged":[[0,15,0,18],[5,12,5,13]]}
[{"$nulls":15},{"$f":"C2","v":2025}]
[null,null,2025,{"$nulls":12},"Gesamt",null,"GUV"]
[{"$nulls":15},"Anzahl","hh:mm","Anzahl","hh:mm"]
[null,"Tauchgang","Datum","Einstieg","Ausstieg","Tiefe","Art","Bemerkung","Zeit",null,"GUV","Gesamt","GUV","Gesamt",null,{"$f":"COUNT(A7:A100)","v":0},{"$f":"M101+N101","v":0},{"$f":"COUNTIF(G7:G100,\"GUV\")","v":0},{"$f":"M101","v":0}]
[{"$nulls":10},"hh:mm","hh:mm"]
[{"$nulls":10},{"$f":"'2024'!$K$101","v":0},{"$f":"'2024'!$L$101","v":0},{"$f":"C2","v":2025}]
[{"$nulls":8},{"$f":"IF(E7>0,E7-D7,0)","v":0},null,{"$f":"IF(G7=\"GUV\",K6+I7,K6)","v":0},{"$f":"L6+I7","v":0},{"$f":"IF(G7=\"GUV\",I7,\" \")","v":" "},{"$f":"IF(G7=\"GUV\",\" \",I7)","v":0}]
[{"$nulls":8},{"$f":"IF(E8>0,E8-D8,0)","v":0},null,{"$f":"IF(G8=\"GUV\",K7+I8,K7)","v":0},{"$f":"L7+I8","v":0},{"$f":"IF(G8=\"GUV\",I8,\" \")","v":" "},{"$f":"IF(G8=\"GUV\",\" \",I8)","v":0}]
[{"$nulls":8},0,null,0,0," ",0]
[{"$nulls":8},0,null,0,0," ",0]
[{"$nulls":8},0,null,0,0," ",0]
[{"$nulls":8},0,null,0,0," ",0]
[{"$nulls":8},0,null,0,0," ",0]
[{"$nulls":8},0,null,0,0," ",0]
[{"$nulls":8},0,null,0,0," ",0]
[{"$nulls":8},0,null,0,0," ",0]
[{"$nulls":8},0,null,0,0," ",0]
[{"$nulls":8},0,null,0,0," ",0]
[{"$nulls":8},0,null,0,0," ",0]
[{"$nulls":8},0,null,0,0," ",0]
[{"$nulls":8},0,null,0,0," ",0]
[{"$nulls":8},0,null,0,0," ",0]
[{"$nulls":8},0,null,0,0," ",0]
[{"$nulls":8},0,null,0,0," ",0]
[{"$nulls":8},0,null,0,0," ",0]
[{"$nulls":8},0,null,0,0," ",0]
[{"$nulls":8},0,null,0,0," ",0]
[{"$nulls":8},0,null,0,0," ",0]
[{"$nulls":8},0,null,0,0," ",0]
[{"$nulls":8},0,null,0,0," ",0]
[{"$nulls":8},0,null,0,0," ",0]
[{"$nulls":8},0,null,0,0," ",0]
[{"$nulls":8},0,null,0,0," ",0]
[{"$nulls":8},0,null,0,0," ",0]
[{"$nulls":8},0,null,0,0," ",0]
[{"$nulls":8},0,null,0,0," ",0]
[{"$nulls":8},0,null,0,0," ",0]
[{"$nulls":8},0,null,0,0," ",0]
[{"$nulls":8},0,null,0,0," ",0]
[{"$nulls":8},0,null,0,0," ",0]
[{"$nulls":8},0,null,0,0," ",0]
[{"$nulls":8},0,null,0,0," ",0]
[{"$nulls":8},0,null,0,0," ",0]
[{"$nulls":8},0,null,0,0," ",0]
[{"$nulls":8},0,null,0,0," ",0]
[{"$nulls":8},0,null,0,0," ",0]
[{"$nulls":8},0,null,0,0," ",0]
[{"$nulls":8},0,null,0,0," ",0]
[{"$nulls":8},0,null,0,0," ",0]
[{"$nulls":8},0,null,0,0," ",0]
[{"$nulls":8},0,null,0,0," ",0]
[{"$nulls":8},0,null,0,0," ",0]
[{"$nulls":8},0,null,0,0," ",0]
[{"$nulls":8},0,null,0,0," ",0]
[{"$nulls":8},0,null,0,0," ",0]
[{"$nulls":8},0,null,0,0," ",0]
[{"$nulls":8},0,null,0,0," ",0]
[{"$nulls":8},0,null,0,0," ",0]
[{"$nulls":8},0,null,0,0," ",0]
[{"$nulls":8},0,null,0,0," ",0]
[{"$nulls":8},0,null,0,0," ",0]
[{"$nulls":8},0,null,0,0," ",0]
[{"$nulls":8},0,null,0,0," ",0]
[{"$nulls":8},0,null,0,0," ",0]
[{"$nulls":8},0,null,0,0," ",0]
[{"$nulls":8},0,null,0,0," ",0]
[{"$nulls":8},0,null,0,0," ",0]
[{"$nulls":8},0,null,0,0," ",0]
[{"$nulls":8},0,null,0,0," ",0]
[{"$nulls":8},0,null,0,0," ",0]
[{"$nulls":8},0,null,0,0," ",0]
[{"$nulls":8},{"$f":"IF(E72>0,E72-D72,0)","v":0},null,{"$f":"IF(G72=\"GUV\",K71+I72,K71)","v":0},{"$f":"L71+I72","v":0},{"$f":"IF(G72=\"GUV\",I72,\" \")","v":" "},{"$f":"IF(G72=\"GUV\",\" \",I72)","v":0}]
[{"$nulls":8},0,null,0,0," ",0]
[{"$nulls":8},0,null,0,0," ",0]
[{"$nulls":8},0,null,0,0," ",0]
[{"$nulls":8},0,null,0,0," ",0]
[{"$nulls":8},0,null,0,0," ",0]
[{"$nulls":8},0,null,0,0," ",0]
[{"$nulls":8},0,null,0,0," ",0]
[{"$nulls":8},0,null,0,0," ",0]
[{"$nulls":8},0,null,0,0," ",0]
[{"$nulls":8},0,null,0,0," ",0]
[{"$nulls":8},0,null,0,0," ",0]
[{"$nulls":8},0,null,0,0," ",0]
[{"$nulls":8},0,null,0,0," ",0]
[{"$nulls":8},0,null,0,0," ",0]
[{"$nulls":8},0,null,0,0," ",0]
[{"$nulls":8},0,null,0,0," ",0]
[{"$nulls":8},0,null,0,0," ",0]
[{"$nulls":8},0,null,0,0," ",0]
[{"$nulls":8},0,null,0,0," ",0]
[{"$nulls":8},0,null,0,0," ",0]
[{"$nulls":8},0,null,0,0," ",0]
[{"$nulls":8},0,null,0,0," ",0]
[{"$nulls":8},0,null,0,0," ",0]
[{"$nulls":8},0,null,0,0," ",0]
[{"$nulls":8},0,null,0,0," ",0]
[{"$nulls":8},0,null,0,0," ",0]
[{"$nulls":8},0,null,0,0," ",0]
[{"$nulls":8},0,null,0,0," ",0]
[{"$nulls":10},{"$f":"MAX(K6:K100)","v":0},{"$f":"MAX(L6:L100)","v":0},{"$f":"SUM(M7:M100)","v":0},{"$f":"SUM(N7:N100)","v":0}]

{"sheet":"2026","index":17,"n_rows":101,"n_cols":19,"rows_kept":101,"merged":[[0,15,0,18],[5,12,5,13]]}
[{"$nulls":15},{"$f":"C2","v":2026}]
[null,null,2026,{"$nulls":12},"Gesamt",null,"GUV"]
[{"$nulls":15},"Anzahl","hh:mm","Anzahl","hh:mm"]
[null,"Tauchgang","Datum","Einstieg","Ausstieg","Tiefe","Art","Bemerkung","Zeit",null,"GUV","Gesamt","GUV","Gesamt",null,{"$f":"COUNT(A7:A100)","v":0},{"$f":"M101+N101","v":0},{"$f":"COUNTIF(G7:G100,\"GUV\")","v":0},{"$f":"M101","v":0}]
[{"$nulls":10},"hh:mm","hh:mm"]
[{"$nulls":10},{"$f":"'2025'!$K$101","v":0},{"$f":"'2025'!$L$101","v":0},{"$f":"C2","v":2026}]
[{"$nulls":8},{"$f":"IF(E7>0,E7-D7,0)","v":0},null,{"$f":"IF(G7=\"GUV\",K6+I7,K6)","v":0},{"$f":"L6+I7","v":0},{"$f":"IF(G7=\"GUV\",I7,\" \")","v":" "},{"$f":"IF(G7=\"GUV\",\" \",I7)","v":0}]
[{"$nulls":8},{"$f":"IF(E8>0,E8-D8,0)","v":0},null,{"$f":"IF(G8=\"GUV\",K7+I8,K7)","v":0},{"$f":"L7+I8","v":0},{"$f":"IF(G8=\"GUV\",I8,\" \")","v":" "},{"$f":"IF(G8=\"GUV\",\" \",I8)","v":0}]
[{"$nulls":8},0,null,0,0," ",0]
[{"$nulls":8},0,null,0,0," ",0]
[{"$nulls":8},0,null,0,0," ",0]
[{"$nulls":8},0,null,0,0," ",0]
[{"$nulls":8},0,null,0,0," ",0]
[{"$nulls":8},0,null,0,0," ",0]
[{"$nulls":8},0,null,0,0," ",0]
[{"$nulls":8},0,null,0,0," ",0]
[{"$nulls":8},0,null,0,0," ",0]
[{"$nulls":8},0,null,0,0," ",0]
[{"$nulls":8},0,null,0,0," ",0]
[{"$nulls":8},0,null,0,0," ",0]
[{"$nulls":8},0,null,0,0," ",0]
[{"$nulls":8},0,null,0,0," ",0]
[{"$nulls":8},0,null,0,0," ",0]
[{"$nulls":8},0,null,0,0," ",0]
[{"$nulls":8},0,null,0,0," ",0]
[{"$nulls":8},0,null,0,0," ",0]
[{"$nulls":8},0,null,0,0," ",0]
[{"$nulls":8},0,null,0,0," ",0]
[{"$nulls":8},0,null,0,0," ",0]
[{"$nulls":8},0,null,0,0," ",0]
[{"$nulls":8},0,null,0,0," ",0]
[{"$nulls":8},0,null,0,0," ",0]
[{"$nulls":8},0,null,0,0," ",0]
[{"$nulls":8},0,null,0,0," ",0]
[{"$nulls":8},0,null,0,0," ",0]
[{"$nulls":8},0,null,0,0," ",0]
[{"$nulls":8},0,null,0,0," ",0]
[{"$nulls":8},0,null,0,0," ",0]
[{"$nulls":8},0,null,0,0," ",0]
[{"$nulls":8},0,null,0,0," ",0]
[{"$nulls":8},0,null,0,0," ",0]
[{"$nulls":8},0,null,0,0," ",0]
[{"$nulls":8},0,null,0,0," ",0]
[{"$nulls":8},0,null,0,0," ",0]
[{"$nulls":8},0,null,0,0," ",0]
[{"$nulls":8},0,null,0,0," ",0]
[{"$nulls":8},0,null,0,0," ",0]
[{"$nulls":8},0,null,0,0," ",0]
[{"$nulls":8},0,null,0,0," ",0]
[{"$nulls":8},0,null,0,0," ",0]
[{"$nulls":8},0,null,0,0," ",0]
[{"$nulls":8},0,null,0,0," ",0]
[{"$nulls":8},0,null,0,0," ",0]
[{"$nulls":8},0,null,0,0," ",0]
[{"$nulls":8},0,null,0,0," ",0]
[{"$nulls":8},0,null,0,0," ",0]
[{"$nulls":8},0,null,0,0," ",0]
[{"$nulls":8},0,null,0,0," ",0]
[{"$nulls":8},0,null,0,0," ",0]
[{"$nulls":8},0,null,0,0," ",0]
[{"$nulls":8},0,null,0,0," ",0]
[{"$nulls":8},0,null,0,0," ",0]
[{"$nulls":8},0,null,0,0," ",0]
[{"$nulls":8},0,null,0,0," ",0]
[{"$nulls":8},0,null,0,0," ",0]
[{"$nulls":8},0,null,0,0," ",0]
[{"$nulls":8},0,null,0,0," ",0]
[{"$nulls":8},0,null,0,0," ",0]
[{"$nulls":8},0,null,0,0," ",0]
[{"$nulls":8},0,null,0,0," ",0]
[{"$nulls":8},0,null,0,0," ",0]
[{"$nulls":8},{"$f":"IF(E72>0,E72-D72,0)","v":0},null,{"$f":"IF(G72=\"GUV\",K71+I72,K71)","v":0},{"$f":"L71+I72","v":0},{"$f":"IF(G72=\"GUV\",I72,\" \")","v":" "},{"$f":"IF(G72=\"GUV\",\" \",I72)","v":0}]
[{"$nulls":8},0,null,0,0," ",0]
[{"$nulls":8},0,null,0,0," ",0]
[{"$nulls":8},0,null,0,0," ",0]
[{"$nulls":8},0,null,0,0," ",0]
[{"$nulls":8},0,null,0,0," ",0]
[{"$nulls":8},0,null,0,0," ",0]
[{"$nulls":8},0,null,0,0," ",0]
[{"$nulls":8},0,null,0,0," ",0]
[{"$nulls":8},0,null,0,0," ",0]
[{"$nulls":8},0,null,0,0," ",0]
[{"$nulls":8},0,null,0,0," ",0]
[{"$nulls":8},0,null,0,0," ",0]
[{"$nulls":8},0,null,0,0," ",0]
[{"$nulls":8},0,null,0,0," ",0]
[{"$nulls":8},0,null,0,0," ",0]
[{"$nulls":8},0,null,0,0," ",0]
[{"$nulls":8},0,null,0,0," ",0]
[{"$nulls":8},0,null,0,0," ",0]
[{"$nulls":8},0,null,0,0," ",0]
[{"$nulls":8},0,null,0,0," ",0]
[{"$nulls":8},0,null,0,0," ",0]
[{"$nulls":8},0,null,0,0," ",0]
[{"$nulls":8},0,null,0,0," ",0]
[{"$nulls":8},0,null,0,0," ",0]
[{"$nulls":8},0,null,0,0," ",0]
[{"$nulls":8},0,null,0,0," ",0]
[{"$nulls":8},0,null,0,0," ",0]
[{"$nulls":8},0,null,0,0," ",0]
[{"$nulls":10},{"$f":"MAX(K6:K100)","v":0},{"$f":"MAX(L6:L100)","v":0},{"$f":"SUM(M7:M100)","v":0},{"$f":"SUM(N7:N100)","v":0}]

{"sheet":"2027","index":18,"n_rows":101,"n_cols":19,"rows_kept":101,"merged":[[0,15,0,18],[5,12,5,13]]}
[{"$nulls":15},{"$f":"C2","v":2027}]
[null,null,2027,{"$nulls":12},"Gesamt",null,"GUV"]
[{"$nulls":15},"Anzahl","hh:mm","Anzahl","hh:mm"]
[null,"Tauchgang","Datum","Einstieg","Ausstieg","Tiefe","Art","Bemerkung","Zeit",null,"GUV","Gesamt","GUV","Gesamt",null,{"$f":"COUNT(A7:A100)","v":0},{"$f":"M101+N101","v":0},{"$f":"COUNTIF(G7:G100,\"GUV\")","v":0},{"$f":"M101","v":0}]
[{"$nulls":10},"hh:mm","hh:mm"]
[{"$nulls":10},{"$f":"'2026'!$K$101","v":0},{"$f":"'2026'!$L$101","v":0},{"$f":"C2","v":2027}]
[{"$nulls":8},{"$f":"IF(E7>0,E7-D7,0)","v":0},null,{"$f":"IF(G7=\"GUV\",K6+I7,K6)","v":0},{"$f":"L6+I7","v":0},{"$f":"IF(G7=\"GUV\",I7,\" \")","v":" "},{"$f":"IF(G7=\"GUV\",\" \",I7)","v":0}]
[{"$nulls":8},{"$f":"IF(E8>0,E8-D8,0)","v":0},null,{"$f":"IF(G8=\"GUV\",K7+I8,K7)","v":0},{"$f":"L7+I8","v":0},{"$f":"IF(G8=\"GUV\",I8,\" \")","v":" "},{"$f":"IF(G8=\"GUV\",\" \",I8)","v":0}]
[{"$nulls":8},0,null,0,0," ",0]
[{"$nulls":8},0,null,0,0," ",0]
[{"$nulls":8},0,null,0,0," ",0]
[{"$nulls":8},0,null,0,0," ",0]
[{"$nulls":8},0,null,0,0," ",0]
[{"$nulls":8},0,null,0,0," ",0]
[{"$nulls":8},0,null,0,0," ",0]
[{"$nulls":8},0,null,0,0," ",0]
[{"$nulls":8},0,null,0,0," ",0]
[{"$nulls":8},0,null,0,0," ",0]
[{"$nulls":8},0,null,0,0," ",0]
[{"$nulls":8},0,null,0,0," ",0]
[{"$nulls":8},0,null,0,0," ",0]
[{"$nulls":8},0,null,0,0," ",0]
[{"$nulls":8},0,null,0,0," ",0]
[{"$nulls":8},0,null,0,0," ",0]
[{"$nulls":8},0,null,0,0," ",0]
[{"$nulls":8},0,null,0,0," ",0]
[{"$nulls":8},0,null,0,0," ",0]
[{"$nulls":8},0,null,0,0," ",0]
[{"$nulls":8},0,null,0,0," ",0]
[{"$nulls":8},0,null,0,0," ",0]
[{"$nulls":8},0,null,0,0," ",0]
[{"$nulls":8},0,null,0,0," ",0]
[{"$nulls":8},0,null,0,0," ",0]
[{"$nulls":8},0,null,0,0," ",0]
[{"$nulls":8},0,null,0,0," ",0]
[{"$nulls":8},0,null,0,0," ",0]
[{"$nulls":8},0,null,0,0," ",0]
[{"$nulls":8},0,null,0,0," ",0]
[{"$nulls":8},0,null,0,0," ",0]
[{"$nulls":8},0,null,0,0," ",0]
[{"$nulls":8},0,null,0,0," ",0]
[{"$nulls":8},0,null,0,0," ",0]
[{"$nulls":8},0,null,0,0," ",0]
[{"$nulls":8},0,null,0,0," ",0]
[{"$nulls":8},0,null,0,0," ",0]
[{"$nulls":8},0,null,0,0," ",0]
[{"$nulls":8},0,null,0,0," ",0]
[{"$nulls":8},0,null,0,0," ",0]
[{"$nulls":8},0,null,0,0," ",0]
[{"$nulls":8},0,null,0,0," ",0]
[{"$nulls":8},0,null,0,0," ",0]
[{"$nulls":8},0,null,0,0," ",0]
[{"$nulls":8},0,null,0,0," ",0]
[{"$nulls":8},0,null,0,0," ",0]
[{"$nulls":8},0,null,0,0," ",0]
[{"$nulls":8},0,null,0,0," ",0]
[{"$nulls":8},0,null,0,0," ",0]
[{"$nulls":8},0,null,0,0," ",0]
[{"$nulls":8},0,null,0,0," ",0]
[{"$nulls":8},0,null,0,0," ",0]
[{"$nulls":8},0,null,0,0," ",0]
[{"$nulls":8},0,null,0,0," ",0]
[{"$nulls":8},0,null,0,0," ",0]
[{"$nulls":8},0,null,0,0," ",0]
[{"$nulls":8},0,null,0,0," ",0]
[{"$nulls":8},0,null,0,0," ",0]
[{"$nulls":8},0,null,0,0," ",0]
[{"$nulls":8},0,null,0,0," ",0]
[{"$nulls":8},0,null,0,0," ",0]
[{"$nulls":8},0,null,0,0," ",0]
[{"$nulls":8},0,null,0,0," ",0]
[{"$nulls":8},{"$f":"IF(E72>0,E72-D72,0)","v":0},null,{"$f":"IF(G72=\"GUV\",K71+I72,K71)","v":0},{"$f":"L71+I72","v":0},{"$f":"IF(G72=\"GUV\",I72,\" \")","v":" "},{"$f":"IF(G72=\"GUV\",\" \",I72)","v":0}]
[{"$nulls":8},0,null,0,0," ",0]
[{"$nulls":8},0,null,0,0," ",0]
[{"$nulls":8},0,null,0,0," ",0]
[{"$nulls":8},0,null,0,0," ",0]
[{"$nulls":8},0,null,0,0," ",0]
[{"$nulls":8},0,null,0,0," ",0]
[{"$nulls":8},0,null,0,0," ",0]
[{"$nulls":8},0,null,0,0," ",0]
[{"$nulls":8},0,null,0,0," ",0]
[{"$nulls":8},0,null,0,0," ",0]
[{"$nulls":8},0,null,0,0," ",0]
[{"$nulls":8},0,null,0,0," ",0]
[{"$nulls":8},0,null,0,0," ",0]
[{"$nulls":8},0,null,0,0," ",0]
[{"$nulls":8},0,null,0,0," ",0]
[{"$nulls":8},0,null,0,0," ",0]
[{"$nulls":8},0,null,0,0," ",0]
[{"$nulls":8},0,null,0,0," ",0]
[{"$nulls":8},0,null,0,0," ",0]
[{"$nulls":8},0,null,0,0," ",0]
[{"$nulls":8},0,null,0,0," ",0]
[{"$nulls":8},0,null,0,0," ",0]
[{"$nulls":8},0,null,0,0," ",0]
[{"$nulls":8},0,null,0,0," ",0]
[{"$nulls":8},0,null,0,0," ",0]
[{"$nulls":8},0,null,0,0," ",0]
[{"$nulls":8},0,null,0,0," ",0]
[{"$nulls":8},0,null,0,0," ",0]
[{"$nulls":10},{"$f":"MAX(K6:K100)","v":0},{"$f":"MAX(L6:L100)","v":0},{"$f":"SUM(M7:M100)","v":0},{"$f":"SUM(N7:N100)","v":0}]

{"sheet":"2028","index":19,"n_rows":101,"n_cols":19,"rows_kept":101,"merged":[[0,15,0,18],[5,12,5,13]]}
[{"$nulls":15},{"$f":"C2","v":2028}]
[null,null,2028,{"$nulls":12},"Gesamt",null,"GUV"]
[{"$nulls":15},"Anzahl","hh:mm","Anzahl","hh:mm"]
[null,"Tauchgang","Datum","Einstieg","Ausstieg","Tiefe","Art","Bemerkung","Zeit",null,"GUV","Gesamt","GUV","Gesamt",null,{"$f":"COUNT(A7:A100)","v":0},{"$f":"M101+N101","v":0},{"$f":"COUNTIF(G7:G100,\"GUV\")","v":0},{"$f":"M101","v":0}]
[{"$nulls":10},"hh:mm","hh:mm"]
[{"$nulls":10},{"$f":"'2027'!$K$101","v":0},{"$f":"'2027'!$L$101","v":0},{"$f":"C2","v":2028}]
[{"$nulls":8},{"$f":"IF(E7>0,E7-D7,0)","v":0},null,{"$f":"IF(G7=\"GUV\",K6+I7,K6)","v":0},{"$f":"L6+I7","v":0},{"$f":"IF(G7=\"GUV\",I7,\" \")","v":" "},{"$f":"IF(G7=\"GUV\",\" \",I7)","v":0}]
[{"$nulls":8},{"$f":"IF(E8>0,E8-D8,0)","v":0},null,{"$f":"IF(G8=\"GUV\",K7+I8,K7)","v":0},{"$f":"L7+I8","v":0},{"$f":"IF(G8=\"GUV\",I8,\" \")","v":" "},{"$f":"IF(G8=\"GUV\",\" \",I8)","v":0}]
[{"$nulls":8},0,null,0,0," ",0]
[{"$nulls":8},0,null,0,0," ",0]
[{"$nulls":8},0,null,0,0," ",0]
[{"$nulls":8},0,null,0,0," ",0]
[{"$nulls":8},0,null,0,0," ",0]
[{"$nulls":8},0,null,0,0," ",0]
[{"$nulls":8},0,null,0,0," ",0]
[{"$nulls":8},0,null,0,0," ",0]
[{"$nulls":8},0,null,0,0," ",0]
[{"$nulls":8},0,null,0,0," ",0]
[{"$nulls":8},0,null,0,0," ",0]
[{"$nulls":8},0,null,0,0," ",0]
[{"$nulls":8},0,null,0,0," ",0]
[{"$nulls":8},0,null,0,0," ",0]
[{"$nulls":8},0,null,0,0," ",0]
[{"$nulls":8},0,null,0,0," ",0]
[{"$nulls":8},0,null,0,0," ",0]
[{"$nulls":8},0,null,0,0," ",0]
[{"$nulls":8},0,null,0,0," ",0]
[{"$nulls":8},0,null,0,0," ",0]
[{"$nulls":8},0,null,0,0," ",0]
[{"$nulls":8},0,null,0,0," ",0]
[{"$nulls":8},0,null,0,0," ",0]
[{"$nulls":8},0,null,0,0," ",0]
[{"$nulls":8},0,null,0,0," ",0]
[{"$nulls":8},0,null,0,0," ",0]
[{"$nulls":8},0,null,0,0," ",0]
[{"$nulls":8},0,null,0,0," ",0]
[{"$nulls":8},0,null,0,0," ",0]
[{"$nulls":8},0,null,0,0," ",0]
[{"$nulls":8},0,null,0,0," ",0]
[{"$nulls":8},0,null,0,0," ",0]
[{"$nulls":8},0,null,0,0," ",0]
[{"$nulls":8},0,null,0,0," ",0]
[{"$nulls":8},0,null,0,0," ",0]
[{"$nulls":8},0,null,0,0," ",0]
[{"$nulls":8},0,null,0,0," ",0]
[{"$nulls":8},0,null,0,0," ",0]
[{"$nulls":8},0,null,0,0," ",0]
[{"$nulls":8},0,null,0,0," ",0]
[{"$nulls":8},0,null,0,0," ",0]
[{"$nulls":8},0,null,0,0," ",0]
[{"$nulls":8},0,null,0,0," ",0]
[{"$nulls":8},0,null,0,0," ",0]
[{"$nulls":8},0,null,0,0," ",0]
[{"$nulls":8},0,null,0,0," ",0]
[{"$nulls":8},0,null,0,0," ",0]
[{"$nulls":8},0,null,0,0," ",0]
[{"$nulls":8},0,null,0,0," ",0]
[{"$nulls":8},0,null,0,0," ",0]
[{"$nulls":8},0,null,0,0," ",0]
[{"$nulls":8},0,null,0,0," ",0]
[{"$nulls":8},0,null,0,0," ",0]
[{"$nulls":8},0,null,0,0," ",0]
[{"$nulls":8},0,null,0,0," ",0]
[{"$nulls":8},0,null,0,0," ",0]
[{"$nulls":8},0,null,0,0," ",0]
[{"$nulls":8},0,null,0,0," ",0]
[{"$nulls":8},0,null,0,0," ",0]
[{"$nulls":8},0,null,0,0," ",0]
[{"$nulls":8},0,null,0,0," ",0]
[{"$nulls":8},0,null,0,0," ",0]
[{"$nulls":8},0,null,0,0," ",0]
[{"$nulls":8},{"$f":"IF(E72>0,E72-D72,0)","v":0},null,{"$f":"IF(G72=\"GUV\",K71+I72,K71)","v":0},{"$f":"L71+I72","v":0},{"$f":"IF(G72=\"GUV\",I72,\" \")","v":" "},{"$f":"IF(G72=\"GUV\",\" \",I72)","v":0}]
[{"$nulls":8},0,null,0,0," ",0]
[{"$nulls":8},0,null,0,0," ",0]
[{"$nulls":8},0,null,0,0," ",0]
[{"$nulls":8},0,null,0,0," ",0]
[{"$nulls":8},0,null,0,0," ",0]
[{"$nulls":8},0,null,0,0," ",0]
[{"$nulls":8},0,null,0,0," ",0]
[{"$nulls":8},0,null,0,0," ",0]
[{"$nulls":8},0,null,0,0," ",0]
[{"$nulls":8},0,null,0,0," ",0]
[{"$nulls":8},0,null,0,0," ",0]
[{"$nulls":8},0,null,0,0," ",0]
[{"$nulls":8},0,null,0,0," ",0]
[{"$nulls":8},0,null,0,0," ",0]
[{"$nulls":8},0,null,0,0," ",0]
[{"$nulls":8},0,null,0,0," ",0]
[{"$nulls":8},0,null,0,0," ",0]
[{"$nulls":8},0,null,0,0," ",0]
[{"$nulls":8},0,null,0,0," ",0]
[{"$nulls":8},0,null,0,0," ",0]
[{"$nulls":8},0,null,0,0," ",0]
[{"$nulls":8},0,null,0,0," ",0]
[{"$nulls":8},0,null,0,0," ",0]
[{"$nulls":8},0,null,0,0," ",0]
[{"$nulls":8},0,null,0,0," ",0]
[{"$nulls":8},0,null,0,0," ",0]
[{"$nulls":8},0,null,0,0," ",0]
[{"$nulls":8},0,null,0,0," ",0]
[{"$nulls":10},{"$f":"MAX(K6:K100)","v":0},{"$f":"MAX(L6:L100)","v":0},{"$f":"SUM(M7:M100)","v":0},{"$f":"SUM(N7:N100)","v":0}]

{"sheet":"2029","index":20,"n_rows":101,"n_cols":19,"rows_kept":101,"merged":[[0,15,0,18],[5,12,5,13]]}
[{"$nulls":15},{"$f":"C2","v":2029}]
[null,null,2029,{"$nulls":12},"Gesamt",null,"GUV"]
[{"$nulls":15},"Anzahl","hh:mm","Anzahl","hh:mm"]
[null,"Tauchgang","Datum","Einstieg","Ausstieg","Tiefe","Art","Bemerkung","Zeit",null,"GUV","Gesamt","GUV","Gesamt",null,{"$f":"COUNT(A7:A100)","v":0},{"$f":"M101+N101","v":0},{"$f":"COUNTIF(G7:G100,\"GUV\")","v":0},{"$f":"M101","v":0}]
[{"$nulls":10},"hh:mm","hh:mm"]
[{"$nulls":10},{"$f":"'2028'!$K$101","v":0},{"$f":"'2028'!$L$101","v":0},{"$f":"C2","v":2029}]
[{"$nulls":8},{"$f":"IF(E7>0,E7-D7,0)","v":0},null,{"$f":"IF(G7=\"GUV\",K6+I7,K6)","v":0},{"$f":"L6+I7","v":0},{"$f":"IF(G7=\"GUV\",I7,\" \")","v":" "},{"$f":"IF(G7=\"GUV\",\" \",I7)","v":0}]
[{"$nulls":8},{"$f":"IF(E8>0,E8-D8,0)","v":0},null,{"$f":"IF(G8=\"GUV\",K7+I8,K7)","v":0},{"$f":"L7+I8","v":0},{"$f":"IF(G8=\"GUV\",I8,\" \")","v":" "},{"$f":"IF(G8=\"GUV\",\" \",I8)","v":0}]
[{"$nulls":8},0,null,0,0," ",0]
[{"$nulls":8},0,null,0,0," ",0]
[{"$nulls":8},0,null,0,0," ",0]
[{"$nulls":8},0,null,0,0," ",0]
[{"$nulls":8},0,null,0,0," ",0]
[{"$nulls":8},0,null,0,0," ",0]
[{"$nulls":8},0,null,0,0," ",0]
[{"$nulls":8},0,null,0,0," ",0]
[{"$nulls":8},0,null,0,0," ",0]
[{"$nulls":8},0,null,0,0," ",0]
[{"$nulls":8},0,null,0,0," ",0]
[{"$nulls":8},0,null,0,0," ",0]
[{"$nulls":8},0,null,0,0," ",0]
[{"$nulls":8},0,null,0,0," ",0]
[{"$nulls":8},0,null,0,0," ",0]
[{"$nulls":8},0,null,0,0," ",0]
[{"$nulls":8},0,null,0,0," ",0]
[{"$nulls":8},0,null,0,0," ",0]
[{"$nulls":8},0,null,0,0," ",0]
[{"$nulls":8},0,null,0,0," ",0]
[{"$nulls":8},0,null,0,0," ",0]
[{"$nulls":8},0,null,0,0," ",0]
[{"$nulls":8},0,null,0,0," ",0]
[{"$nulls":8},0,null,0,0," ",0]
[{"$nulls":8},0,null,0,0," ",0]
[{"$nulls":8},0,null,0,0," ",0]
[{"$nulls":8},0,null,0,0," ",0]
[{"$nulls":8},0,null,0,0," ",0]
[{"$nulls":8},0,null,0,0," ",0]
[{"$nulls":8},0,null,0,0," ",0]
[{"$nulls":8},0,null,0,0," ",0]
[{"$nulls":8},0,null,0,0," ",0]
[{"$nulls":8},0,null,0,0," ",0]
[{"$nulls":8},0,null,0,0," ",0]
[{"$nulls":8},0,null,0,0," ",0]
[{"$nulls":8},0,null,0,0," ",0]
[{"$nulls":8},0,null,0,0," ",0]
[{"$nulls":8},0,null,0,0," ",0]
[{"$nulls":8},0,null,0,0," ",0]
[{"$nulls":8},0,null,0,0," ",0]
[{"$nulls":8},0,null,0,0," ",0]
[{"$nulls":8},0,null,0,0," ",0]
[{"$nulls":8},0,null,0,0," ",0]
[{"$nulls":8},0,null,0,0," ",0]
[{"$nulls":8},0,null,0,0," ",0]
[{"$nulls":8},0,null,0,0," ",0]
[{"$nulls":8},0,null,0,0," ",0]
[{"$nulls":8},0,null,0,0," ",0]
[{"$nulls":8},0,null,0,0," ",0]
[{"$nulls":8},0,null,0,0," ",0]
[{"$nulls":8},0,null,0,0," ",0]
[{"$nulls":8},0,null,0,0," ",0]
[{"$nulls":8},0,null,0,0," ",0]
[{"$nulls":8},0,null,0,0," ",0]
[{"$nulls":8},0,null,0,0," ",0]
[{"$nulls":8},0,null,0,0," ",0]
[{"$nulls":8},0,null,0,0," ",0]
[{"$nulls":8},0,null,0,0," ",0]
[{"$nulls":8},0,null,0,0," ",0]
[{"$nulls":8},0,null,0,0," ",0]
[{"$nulls":8},0,null,0,0," ",0]
[{"$nulls":8},0,null,0,0," ",0]
[{"$nulls":8},0,null,0,0," ",0]
[{"$nulls":8},{"$f":"IF(E72>0,E72-D72,0)","v":0},null,{"$f":"IF(G72=\"GUV\",K71+I72,K71)","v":0},{"$f":"L71+I72","v":0},{"$f":"IF(G72=\"GUV\",I72,\" \")","v":" "},{"$f":"IF(G72=\"GUV\",\" \",I72)","v":0}]
[{"$nulls":8},0,null,0,0," ",0]
[{"$nulls":8},0,null,0,0," ",0]
[{"$nulls":8},0,null,0,0," ",0]
[{"$nulls":8},0,null,0,0," ",0]
[{"$nulls":8},0,null,0,0," ",0]
[{"$nulls":8},0,null,0,0," ",0]
[{"$nulls":8},0,null,0,0," ",0]
[{"$nulls":8},0,null,0,0," ",0]
[{"$nulls":8},0,null,0,0," ",0]
[{"$nulls":8},0,null,0,0," ",0]
[{"$nulls":8},0,null,0,0," ",0]
[{"$nulls":8},0,null,0,0," ",0]
[{"$nulls":8},0,null,0,0," ",0]
[{"$nulls":8},0,null,0,0," ",0]
[{"$nulls":8},0,null,0,0," ",0]
[{"$nulls":8},0,null,0,0," ",0]
[{"$nulls":8},0,null,0,0," ",0]
[{"$nulls":8},0,null,0,0," ",0]
[{"$nulls":8},0,null,0,0," ",0]
[{"$nulls":8},0,null,0,0," ",0]
[{"$nulls":8},0,null,0,0," ",0]
[{"$nulls":8},0,null,0,0," ",0]
[{"$nulls":8},0,null,0,0," ",0]
[{"$nulls":8},0,null,0,0," ",0]
[{"$nulls":8},0,null,0,0," ",0]
[{"$nulls":8},0,null,0,0," ",0]
[{"$nulls":8},0,null,0,0," ",0]
[{"$nulls":8},0,null,0,0," ",0]
[{"$nulls":10},{"$f":"MAX(K6:K100)","v":0},{"$f":"MAX(L6:L100)","v":0},{"$f":"SUM(M7:M100)","v":0},{"$f":"SUM(N7:N100)","v":0}]

{"sheet":"2030","index":21,"n_rows":101,"n_cols":19,"rows_kept":101,"merged":[[0,15,0,18],[5,12,5,13]]}
[{"$nulls":15},{"$f":"C2","v":2030}]
[null,null,2030,{"$nulls":12},"Gesamt",null,"GUV"]
[{"$nulls":15},"Anzahl","hh:mm","Anzahl","hh:mm"]
[null,"Tauchgang","Datum","Einstieg","Ausstieg","Tiefe","Art","Bemerkung","Zeit",null,"GUV","Gesamt","GUV","Gesamt",null,{"$f":"COUNT(A7:A100)","v":0},{"$f":"M101+N101","v":0},{"$f":"COUNTIF(G7:G100,\"GUV\")","v":0},{"$f":"M101","v":0}]
[{"$nulls":10},"hh:mm","hh:mm"]
[{"$nulls":10},{"$f":"'2029'!$K$101","v":0},{"$f":"'2029'!$L$101","v":0},{"$f":"C2","v":2030}]
[{"$nulls":8},{"$f":"IF(E7>0,E7-D7,0)","v":0},null,{"$f":"IF(G7=\"GUV\",K6+I7,K6)","v":0},{"$f":"L6+I7","v":0},{"$f":"IF(G7=\"GUV\",I7,\" \")","v":" "},{"$f":"IF(G7=\"GUV\",\" \",I7)","v":0}]
[{"$nulls":8},{"$f":"IF(E8>0,E8-D8,0)","v":0},null,{"$f":"IF(G8=\"GUV\",K7+I8,K7)","v":0},{"$f":"L7+I8","v":0},{"$f":"IF(G8=\"GUV\",I8,\" \")","v":" "},{"$f":"IF(G8=\"GUV\",\" \",I8)","v":0}]
[{"$nulls":8},0,null,0,0," ",0]
[{"$nulls":8},0,null,0,0," ",0]
[{"$nulls":8},0,null,0,0," ",0]
[{"$nulls":8},0,null,0,0," ",0]
[{"$nulls":8},0,null,0,0," ",0]
[{"$nulls":8},0,null,0,0," ",0]
[{"$nulls":8},0,null,0,0," ",0]
[{"$nulls":8},0,null,0,0," ",0]
[{"$nulls":8},0,null,0,0," ",0]
[{"$nulls":8},0,null,0,0," ",0]
[{"$nulls":8},0,null,0,0," ",0]
[{"$nulls":8},0,null,0,0," ",0]
[{"$nulls":8},0,null,0,0," ",0]
[{"$nulls":8},0,null,0,0," ",0]
[{"$nulls":8},0,null,0,0," ",0]
[{"$nulls":8},0,null,0,0," ",0]
[{"$nulls":8},0,null,0,0," ",0]
[{"$nulls":8},0,null,0,0," ",0]
[{"$nulls":8},0,null,0,0," ",0]
[{"$nulls":8},0,null,0,0," ",0]
[{"$nulls":8},0,null,0,0," ",0]
[{"$nulls":8},0,null,0,0," ",0]
[{"$nulls":8},0,null,0,0," ",0]
[{"$nulls":8},0,null,0,0," ",0]
[{"$nulls":8},0,null,0,0," ",0]
[{"$nulls":8},0,null,0,0," ",0]
[{"$nulls":8},0,null,0,0," ",0]
[{"$nulls":8},0,null,0,0," ",0]
[{"$nulls":8},0,null,0,0," ",0]
[{"$nulls":8},0,null,0,0," ",0]
[{"$nulls":8},0,null,0,0," ",0]
[{"$nulls":8},0,null,0,0," ",0]
[{"$nulls":8},0,null,0,0," ",0]
[{"$nulls":8},0,null,0,0," ",0]
[{"$nulls":8},0,null,0,0," ",0]
[{"$nulls":8},0,null,0,0," ",0]
[{"$nulls":8},0,null,0,0," ",0]
[{"$nulls":8},0,null,0,0," ",0]
[{"$nulls":8},0,null,0,0," ",0]
[{"$nulls":8},0,null,0,0," ",0]
[{"$nulls":8},0,null,0,0," ",0]
[{"$nulls":8},0,null,0,0," ",0]
[{"$nulls":8},0,null,0,0," ",0]
[{"$nulls":8},0,null,0,0," ",0]
[{"$nulls":8},0,null,0,0," ",0]
[{"$nulls":8},0,null,0,0," ",0]
[{"$nulls":8},0,null,0,0," ",0]
[{"$nulls":8},0,null,0,0," ",0]
[{"$nulls":8},0,null,0,0," ",0]
[{"$nulls":8},0,null,0,0," ",0]
[{"$nulls":8},0,null,0,0," ",0]
[{"$nulls":8},0,null,0,0," ",0]
[{"$nulls":8},0,null,0,0," ",0]
[{"$nulls":8},0,null,0,0," ",0]
[{"$nulls":8},0,null,0,0," ",0]
[{"$nulls":8},0,null,0,0," ",0]
[{"$nulls":8},0,null,0,0," ",0]
[{"$nulls":8},0,null,0,0," ",0]
[{"$nulls":8},0,null,0,0," ",0]
[{"$nulls":8},0,null,0,0," ",0]
[{"$nulls":8},0,null,0,0," ",0]
[{"$nulls":8},0,null,0,0," ",0]
[{"$nulls":8},0,null,0,0," ",0]
[{"$nulls":8},{"$f":"IF(E72>0,E72-D72,0)","v":0},null,{"$f":"IF(G72=\"GUV\",K71+I72,K71)","v":0},{"$f":"L71+I72","v":0},{"$f":"IF(G72=\"GUV\",I72,\" \")","v":" "},{"$f":"IF(G72=\"GUV\",\" \",I72)","v":0}]
[{"$nulls":8},0,null,0,0," ",0]
[{"$nulls":8},0,null,0,0," ",0]
[{"$nulls":8},0,null,0,0," ",0]
[{"$nulls":8},0,null,0,0," ",0]
[{"$nulls":8},0,null,0,0," ",0]
[{"$nulls":8},0,null,0,0," ",0]
[{"$nulls":8},0,null,0,0," ",0]
[{"$nulls":8},0,null,0,0," ",0]
[{"$nulls":8},0,null,0,0," ",0]
[{"$nulls":8},0,null,0,0," ",0]
[{"$nulls":8},0,null,0,0," ",0]
[{"$nulls":8},0,null,0,0," ",0]
[{"$nulls":8},0,null,0,0," ",0]
[{"$nulls":8},0,null,0,0," ",0]
[{"$nulls":8},0,null,0,0," ",0]
[{"$nulls":8},0,null,0,0," ",0]
[{"$nulls":8},0,null,0,0," ",0]
[{"$nulls":8},0,null,0,0," ",0]
[{"$nulls":8},0,null,0,0," ",0]
[{"$nulls":8},0,null,0,0," ",0]
[{"$nulls":8},0,null,0,0," ",0]
[{"$nulls":8},0,null,0,0," ",0]
[{"$nulls":8},0,null,0,0," ",0]
[{"$nulls":8},0,null,0,0," ",0]
[{"$nulls":8},0,null,0,0," ",0]
[{"$nulls":8},0,null,0,0," ",0]
[{"$nulls":8},0,null,0,0," ",0]
[{"$nulls":8},0,null,0,0," ",0]
[{"$nulls":10},{"$f":"MAX(K6:K100)","v":0},{"$f":"MAX(L6:L100)","v":0},{"$f":"SUM(M7:M100)","v":0},{"$f":"SUM(N7:N100)","v":0}]

{"sheet":"2031","index":22,"n_rows":101,"n_cols":19,"rows_kept":101,"merged":[[0,15,0,18],[5,12,5,13]]}
[{"$nulls":15},{"$f":"C2","v":2031}]
[null,null,2031,{"$nulls":12},"Gesamt",null,"GUV"]
[{"$nulls":15},"Anzahl","hh:mm","Anzahl","hh:mm"]
[null,"Tauchgang","Datum","Einstieg","Ausstieg","Tiefe","Art","Bemerkung","Zeit",null,"GUV","Gesamt","GUV","Gesamt",null,{"$f":"COUNT(A7:A100)","v":0},{"$f":"M101+N101","v":0},{"$f":"COUNTIF(G7:G100,\"GUV\")","v":0},{"$f":"M101","v":0}]
[{"$nulls":10},"hh:mm","hh:mm"]
[{"$nulls":10},{"$f":"'2030'!$K$101","v":0},{"$f":"'2030'!$L$101","v":0},{"$f":"C2","v":2031}]
[{"$nulls":8},{"$f":"IF(E7>0,E7-D7,0)","v":0},null,{"$f":"IF(G7=\"GUV\",K6+I7,K6)","v":0},{"$f":"L6+I7","v":0},{"$f":"IF(G7=\"GUV\",I7,\" \")","v":" "},{"$f":"IF(G7=\"GUV\",\" \",I7)","v":0}]
[{"$nulls":8},{"$f":"IF(E8>0,E8-D8,0)","v":0},null,{"$f":"IF(G8=\"GUV\",K7+I8,K7)","v":0},{"$f":"L7+I8","v":0},{"$f":"IF(G8=\"GUV\",I8,\" \")","v":" "},{"$f":"IF(G8=\"GUV\",\" \",I8)","v":0}]
[{"$nulls":8},0,null,0,0," ",0]
[{"$nulls":8},0,null,0,0," ",0]
[{"$nulls":8},0,null,0,0," ",0]
[{"$nulls":8},0,null,0,0," ",0]
[{"$nulls":8},0,null,0,0," ",0]
[{"$nulls":8},0,null,0,0," ",0]
[{"$nulls":8},0,null,0,0," ",0]
[{"$nulls":8},0,null,0,0," ",0]
[{"$nulls":8},0,null,0,0," ",0]
[{"$nulls":8},0,null,0,0," ",0]
[{"$nulls":8},0,null,0,0," ",0]
[{"$nulls":8},0,null,0,0," ",0]
[{"$nulls":8},0,null,0,0," ",0]
[{"$nulls":8},0,null,0,0," ",0]
[{"$nulls":8},0,null,0,0," ",0]
[{"$nulls":8},0,null,0,0," ",0]
[{"$nulls":8},0,null,0,0," ",0]
[{"$nulls":8},0,null,0,0," ",0]
[{"$nulls":8},0,null,0,0," ",0]
[{"$nulls":8},0,null,0,0," ",0]
[{"$nulls":8},0,null,0,0," ",0]
[{"$nulls":8},0,null,0,0," ",0]
[{"$nulls":8},0,null,0,0," ",0]
[{"$nulls":8},0,null,0,0," ",0]
[{"$nulls":8},0,null,0,0," ",0]
[{"$nulls":8},0,null,0,0," ",0]
[{"$nulls":8},0,null,0,0," ",0]
[{"$nulls":8},0,null,0,0," ",0]
[{"$nulls":8},0,null,0,0," ",0]
[{"$nulls":8},0,null,0,0," ",0]
[{"$nulls":8},0,null,0,0," ",0]
[{"$nulls":8},0,null,0,0," ",0]
[{"$nulls":8},0,null,0,0," ",0]
[{"$nulls":8},0,null,0,0," ",0]
[{"$nulls":8},0,null,0,0," ",0]
[{"$nulls":8},0,null,0,0," ",0]
[{"$nulls":8},0,null,0,0," ",0]
[{"$nulls":8},0,null,0,0," ",0]
[{"$nulls":8},0,null,0,0," ",0]
[{"$nulls":8},0,null,0,0," ",0]
[{"$nulls":8},0,null,0,0," ",0]
[{"$nulls":8},0,null,0,0," ",0]
[{"$nulls":8},0,null,0,0," ",0]
[{"$nulls":8},0,null,0,0," ",0]
[{"$nulls":8},0,null,0,0," ",0]
[{"$nulls":8},0,null,0,0," ",0]
[{"$nulls":8},0,null,0,0," ",0]
[{"$nulls":8},0,null,0,0," ",0]
[{"$nulls":8},0,null,0,0," ",0]
[{"$nulls":8},0,null,0,0," ",0]
[{"$nulls":8},0,null,0,0," ",0]
[{"$nulls":8},0,null,0,0," ",0]
[{"$nulls":8},0,null,0,0," ",0]
[{"$nulls":8},0,null,0,0," ",0]
[{"$nulls":8},0,null,0,0," ",0]
[{"$nulls":8},0,null,0,0," ",0]
[{"$nulls":8},0,null,0,0," ",0]
[{"$nulls":8},0,null,0,0," ",0]
[{"$nulls":8},0,null,0,0," ",0]
[{"$nulls":8},0,null,0,0," ",0]
[{"$nulls":8},0,null,0,0," ",0]
[{"$nulls":8},0,null,0,0," ",0]
[{"$nulls":8},0,null,0,0," ",0]
[{"$nulls":8},{"$f":"IF(E72>0,E72-D72,0)","v":0},null,{"$f":"IF(G72=\"GUV\",K71+I72,K71)","v":0},{"$f":"L71+I72","v":0},{"$f":"IF(G72=\"GUV\",I72,\" \")","v":" "},{"$f":"IF(G72=\"GUV\",\" \",I72)","v":0}]
[{"$nulls":8},0,null,0,0," ",0]
[{"$nulls":8},0,null,0,0," ",0]
[{"$nulls":8},0,null,0,0," ",0]
[{"$nulls":8},0,null,0,0," ",0]
[{"$nulls":8},0,null,0,0," ",0]
[{"$nulls":8},0,null,0,0," ",0]
[{"$nulls":8},0,null,0,0," ",0]
[{"$nulls":8},0,null,0,0," ",0]
[{"$nulls":8},0,null,0,0," ",0]
[{"$nulls":8},0,null,0,0," ",0]
[{"$nulls":8},0,null,0,0," ",0]
[{"$nulls":8},0,null,0,0," ",0]
[{"$nulls":8},0,null,0,0," ",0]
[{"$nulls":8},0,null,0,0," ",0]
[{"$nulls":8},0,null,0,0," ",0]
[{"$nulls":8},0,null,0,0," ",0]
[{"$nulls":8},0,null,0,0," ",0]
[{"$nulls":8},0,null,0,0," ",0]
[{"$nulls":8},0,null,0,0," ",0]
[{"$nulls":8},0,null,0,0," ",0]
[{"$nulls":8},0,null,0,0," ",0]
[{"$nulls":8},0,null,0,0," ",0]
[{"$nulls":8},0,null,0,0," ",0]
[{"$nulls":8},0,null,0,0," ",0]
[{"$nulls":8},0,null,0,0," ",0]
[{"$nulls":8},0,null,0,0," ",0]
[{"$nulls":8},0,null,0,0," ",0]
[{"$nulls":8},0,null,0,0," ",0]
[{"$nulls":10},{"$f":"MAX(K6:K100)","v":0},{"$f":"MAX(L6:L100)","v":0},{"$f":"SUM(M7:M100)","v":0},{"$f":"SUM(N7:N100)","v":0}]

{"sheet":"2032","index":23,"n_rows":101,"n_cols":19,"rows_kept":101,"merged":[[0,15,0,18],[5,12,5,13]]}
[{"$nulls":15},{"$f":"C2","v":2032}]
[null,null,2032,{"$nulls":12},"Gesamt",null,"GUV"]
[{"$nulls":15},"Anzahl","hh:mm","Anzahl","hh:mm"]
[null,"Tauchgang","Datum","Einstieg","Ausstieg","Tiefe","Art","Bemerkung","Zeit",null,"GUV","Gesamt","GUV","Gesamt",null,{"$f":"COUNT(A7:A100)","v":0},{"$f":"M101+N101","v":0},{"$f":"COUNTIF(G7:G100,\"GUV\")","v":0},{"$f":"M101","v":0}]
[{"$nulls":10},"hh:mm","hh:mm"]
[{"$nulls":10},{"$f":"Beginn!F14","v":0},{"$f":"Beginn!F19","v":0},{"$f":"C2","v":2032}]
[{"$nulls":8},{"$f":"IF(E7>0,E7-D7,0)","v":0},null,{"$f":"IF(G7=\"GUV\",K6+I7,K6)","v":0},{"$f":"L6+I7","v":0},{"$f":"IF(G7=\"GUV\",I7,\" \")","v":" "},{"$f":"IF(G7=\"GUV\",\" \",I7)","v":0}]
[{"$nulls":8},{"$f":"IF(E8>0,E8-D8,0)","v":0},null,{"$f":"IF(G8=\"GUV\",K7+I8,K7)","v":0},{"$f":"L7+I8","v":0},{"$f":"IF(G8=\"GUV\",I8,\" \")","v":" "},{"$f":"IF(G8=\"GUV\",\" \",I8)","v":0}]
[{"$nulls":8},0,null,0,0," ",0]
[{"$nulls":8},0,null,0,0," ",0]
[{"$nulls":8},0,null,0,0," ",0]
[{"$nulls":8},0,null,0,0," ",0]
[{"$nulls":8},0,null,0,0," ",0]
[{"$nulls":8},0,null,0,0," ",0]
[{"$nulls":8},0,null,0,0," ",0]
[{"$nulls":8},0,null,0,0," ",0]
[{"$nulls":8},0,null,0,0," ",0]
[{"$nulls":8},0,null,0,0," ",0]
[{"$nulls":8},0,null,0,0," ",0]
[{"$nulls":8},0,null,0,0," ",0]
[{"$nulls":8},0,null,0,0," ",0]
[{"$nulls":8},0,null,0,0," ",0]
[{"$nulls":8},0,null,0,0," ",0]
[{"$nulls":8},0,null,0,0," ",0]
[{"$nulls":8},0,null,0,0," ",0]
[{"$nulls":8},0,null,0,0," ",0]
[{"$nulls":8},0,null,0,0," ",0]
[{"$nulls":8},0,null,0,0," ",0]
[{"$nulls":8},0,null,0,0," ",0]
[{"$nulls":8},0,null,0,0," ",0]
[{"$nulls":8},0,null,0,0," ",0]
[{"$nulls":8},0,null,0,0," ",0]
[{"$nulls":8},0,null,0,0," ",0]
[{"$nulls":8},0,null,0,0," ",0]
[{"$nulls":8},0,null,0,0," ",0]
[{"$nulls":8},0,null,0,0," ",0]
[{"$nulls":8},0,null,0,0," ",0]
[{"$nulls":8},0,null,0,0," ",0]
[{"$nulls":8},0,null,0,0," ",0]
[{"$nulls":8},0,null,0,0," ",0]
[{"$nulls":8},0,null,0,0," ",0]
[{"$nulls":8},0,null,0,0," ",0]
[{"$nulls":8},0,null,0,0," ",0]
[{"$nulls":8},0,null,0,0," ",0]
[{"$nulls":8},0,null,0,0," ",0]
[{"$nulls":8},0,null,0,0," ",0]
[{"$nulls":8},0,null,0,0," ",0]
[{"$nulls":8},0,null,0,0," ",0]
[{"$nulls":8},0,null,0,0," ",0]
[{"$nulls":8},0,null,0,0," ",0]
[{"$nulls":8},0,null,0,0," ",0]
[{"$nulls":8},0,null,0,0," ",0]
[{"$nulls":8},0,null,0,0," ",0]
[{"$nulls":8},0,null,0,0," ",0]
[{"$nulls":8},0,null,0,0," ",0]
[{"$nulls":8},0,null,0,0," ",0]
[{"$nulls":8},0,null,0,0," ",0]
[{"$nulls":8},0,null,0,0," ",0]
[{"$nulls":8},0,null,0,0," ",0]
[{"$nulls":8},0,null,0,0," ",0]
[{"$nulls":8},0,null,0,0," ",0]
[{"$nulls":8},0,null,0,0," ",0]
[{"$nulls":8},0,null,0,0," ",0]
[{"$nulls":8},0,null,0,0," ",0]
[{"$nulls":8},0,null,0,0," ",0]
[{"$nulls":8},0,null,0,0," ",0]
[{"$nulls":8},0,null,0,0," ",0]
[{"$nulls":8},0,null,0,0," ",0]
[{"$nulls":8},0,null,0,0," ",0]
[{"$nulls":8},0,null,0,0," ",0]
[{"$nulls":8},0,null,0,0," ",0]
[{"$nulls":8},{"$f":"IF(E72>0,E72-D72,0)","v":0},null,{"$f":"IF(G72=\"GUV\",K71+I72,K71)","v":0},{"$f":"L71+I72","v":0},{"$f":"IF(G72=\"GUV\",I72,\" \")","v":" "},{"$f":"IF(G72=\"GUV\",\" \",I72)","v":0}]
[{"$nulls":8},0,null,0,0," ",0]
[{"$nulls":8},0,null,0,0," ",0]
[{"$nulls":8},0,null,0,0," ",0]
[{"$nulls":8},0,null,0,0," ",0]
[{"$nulls":8},0,null,0,0," ",0]
[{"$nulls":8},0,null,0,0," ",0]
[{"$nulls":8},0,null,0,0," ",0]
[{"$nulls":8},0,null,0,0," ",0]
[{"$nulls":8},0,null,0,0," ",0]
[{"$nulls":8},0,null,0,0," ",0]
[{"$nulls":8},0,null,0,0," ",0]
[{"$nulls":8},0,null,0,0," ",0]
[{"$nulls":8},0,null,0,0," ",0]
[{"$nulls":8},0,null,0,0," ",0]
[{"$nulls":8},0,null,0,0," ",0]
[{"$nulls":8},0,null,0,0," ",0]
[{"$nulls":8},0,null,0,0," ",0]
[{"$nulls":8},0,null,0,0," ",0]
[{"$nulls":8},0,null,0,0," ",0]
[{"$nulls":8},0,null,0,0," ",0]
[{"$nulls":8},0,null,0,0," ",0]
[{"$nulls":8},0,null,0,0," ",0]
[{"$nulls":8},0,null,0,0," ",0]
[{"$nulls":8},0,null,0,0," ",0]
[{"$nulls":8},0,null,0,0," ",0]
[{"$nulls":8},0,null,0,0," ",0]
[{"$nulls":8},0,null,0,0," ",0]
[{"$nulls":8},0,null,0,0," ",0]
[{"$nulls":10},{"$f":"MAX(K6:K100)","v":0},{"$f":"MAX(L6:L100)","v":0},{"$f":"SUM(M7:M100)","v":0},{"$f":"SUM(N7:N100)","v":0}]

{"sheet":"2033","index":24,"n_rows":101,"n_cols":19,"rows_kept":101,"merged":[[0,15,0,18],[5,12,5,13]]}
[{"$nulls":15},{"$f":"C2","v":2033}]
[null,null,2033,{"$nulls":12},"Gesamt",null,"GUV"]
[{"$nulls":15},"Anzahl","hh:mm","Anzahl","hh:mm"]
[null,"Tauchgang","Datum","Einstieg","Ausstieg","Tiefe","Art","Bemerkung","Zeit",null,"GUV","Gesamt","GUV","Gesamt",null,{"$f":"COUNT(A7:A100)","v":0},{"$f":"M101+N101","v":0},{"$f":"COUNTIF(G7:G100,\"GUV\")","v":0},{"$f":"M101","v":0}]
[{"$nulls":10},"hh:mm","hh:mm"]
[{"$nulls":10},{"$f":"'2032'!$K$101","v":0},{"$f":"'2032'!$L$101","v":0},{"$f":"C2","v":2033}]
[{"$nulls":8},{"$f":"IF(E7>0,E7-D7,0)","v":0},null,{"$f":"IF(G7=\"GUV\",K6+I7,K6)","v":0},{"$f":"L6+I7","v":0},{"$f":"IF(G7=\"GUV\",I7,\" \")","v":" "},{"$f":"IF(G7=\"GUV\",\" \",I7)","v":0}]
[{"$nulls":8},{"$f":"IF(E8>0,E8-D8,0)","v":0},null,{"$f":"IF(G8=\"GUV\",K7+I8,K7)","v":0},{"$f":"L7+I8","v":0},{"$f":"IF(G8=\"GUV\",I8,\" \")","v":" "},{"$f":"IF(G8=\"GUV\",\" \",I8)","v":0}]
[{"$nulls":8},0,null,0,0," ",0]
[{"$nulls":8},0,null,0,0," ",0]
[{"$nulls":8},0,null,0,0," ",0]
[{"$nulls":8},0,null,0,0," ",0]
[{"$nulls":8},0,null,0,0," ",0]
[{"$nulls":8},0,null,0,0," ",0]
[{"$nulls":8},0,null,0,0," ",0]
[{"$nulls":8},0,null,0,0," ",0]
[{"$nulls":8},0,null,0,0," ",0]
[{"$nulls":8},0,null,0,0," ",0]
[{"$nulls":8},0,null,0,0," ",0]
[{"$nulls":8},0,null,0,0," ",0]
[{"$nulls":8},0,null,0,0," ",0]
[{"$nulls":8},0,null,0,0," ",0]
[{"$nulls":8},0,null,0,0," ",0]
[{"$nulls":8},0,null,0,0," ",0]
[{"$nulls":8},0,null,0,0," ",0]
[{"$nulls":8},0,null,0,0," ",0]
[{"$nulls":8},0,null,0,0," ",0]
[{"$nulls":8},0,null,0,0," ",0]
[{"$nulls":8},0,null,0,0," ",0]
[{"$nulls":8},0,null,0,0," ",0]
[{"$nulls":8},0,null,0,0," ",0]
[{"$nulls":8},0,null,0,0," ",0]
[{"$nulls":8},0,null,0,0," ",0]
[{"$nulls":8},0,null,0,0," ",0]
[{"$nulls":8},0,null,0,0," ",0]
[{"$nulls":8},0,null,0,0," ",0]
[{"$nulls":8},0,null,0,0," ",0]
[{"$nulls":8},0,null,0,0," ",0]
[{"$nulls":8},0,null,0,0," ",0]
[{"$nulls":8},0,null,0,0," ",0]
[{"$nulls":8},0,null,0,0," ",0]
[{"$nulls":8},0,null,0,0," ",0]
[{"$nulls":8},0,null,0,0," ",0]
[{"$nulls":8},0,null,0,0," ",0]
[{"$nulls":8},0,null,0,0," ",0]
[{"$nulls":8},0,null,0,0," ",0]
[{"$nulls":8},0,null,0,0," ",0]
[{"$nulls":8},0,null,0,0," ",0]
[{"$nulls":8},0,null,0,0," ",0]
[{"$nulls":8},0,null,0,0," ",0]
[{"$nulls":8},0,null,0,0," ",0]
[{"$nulls":8},0,null,0,0," ",0]
[{"$nulls":8},0,null,0,0," ",0]
[{"$nulls":8},0,null,0,0," ",0]
[{"$nulls":8},0,null,0,0," ",0]
[{"$nulls":8},0,null,0,0," ",0]
[{"$nulls":8},0,null,0,0," ",0]
[{"$nulls":8},0,null,0,0," ",0]
[{"$nulls":8},0,null,0,0," ",0]
[{"$nulls":8},0,null,0,0," ",0]
[{"$nulls":8},0,null,0,0," ",0]
[{"$nulls":8},0,null,0,0," ",0]
[{"$nulls":8},0,null,0,0," ",0]
[{"$nulls":8},0,null,0,0," ",0]
[{"$nulls":8},0,null,0,0," ",0]
[{"$nulls":8},0,null,0,0," ",0]
[{"$nulls":8},0,null,0,0," ",0]
[{"$nulls":8},0,null,0,0," ",0]
[{"$nulls":8},0,null,0,0," ",0]
[{"$nulls":8},0,null,0,0," ",0]
[{"$nulls":8},0,null,0,0," ",0]
[{"$nulls":8},{"$f":"IF(E72>0,E72-D72,0)","v":0},null,{"$f":"IF(G72=\"GUV\",K71+I72,K71)","v":0},{"$f":"L71+I72","v":0},{"$f":"IF(G72=\"GUV\",I72,\" \")","v":" "},{"$f":"IF(G72=\"GUV\",\" \",I72)","v":0}]
[{"$nulls":8},0,null,0,0," ",0]
[{"$nulls":8},0,null,0,0," ",0]
[{"$nulls":8},0,null,0,0," ",0]
[{"$nulls":8},0,null,0,0," ",0]
[{"$nulls":8},0,null,0,0," ",0]
[{"$nulls":8},0,null,0,0," ",0]
[{"$nulls":8},0,null,0,0," ",0]
[{"$nulls":8},0,null,0,0," ",0]
[{"$nulls":8},0,null,0,0," ",0]
[{"$nulls":8},0,null,0,0," ",0]
[{"$nulls":8},0,null,0,0," ",0]
[{"$nulls":8},0,null,0,0," ",0]
[{"$nulls":8},0,null,0,0," ",0]
[{"$nulls":8},0,null,0,0," ",0]
[{"$nulls":8},0,null,0,0," ",0]
[{"$nulls":8},0,null,0,0," ",0]
[{"$nulls":8},0,null,0,0," ",0]
[{"$nulls":8},0,null,0,0," ",0]
[{"$nulls":8},0,null,0,0," ",0]
[{"$nulls":8},0,null,0,0," ",0]
[{"$nulls":8},0,null,0,0," ",0]
[{"$nulls":8},0,null,0,0," ",0]
[{"$nulls":8},0,null,0,0," ",0]
[{"$nulls":8},0,null,0,0," ",0]
[{"$nulls":8},0,null,0,0," ",0]
[{"$nulls":8},0,null,0,0," ",0]
[{"$nulls":8},0,null,0,0," ",0]
[{"$nulls":8},0,null,0,0," ",0]
[{"$nulls":10},{"$f":"MAX(K6:K100)","v":0},{"$f":"MAX(L6:L100)","v":0},{"$f":"SUM(M7:M100)","v":0},{"$f":"SUM(N7:N100)","v":0}]

{"sheet":"2034","index":25,"n_rows":101,"n_cols":19,"rows_kept":101,"merged":[[0,15,0,18],[5,12,5,13]]}
[{"$nulls":15},{"$f":"C2","v":2034}]
[null,null,2034,{"$nulls":12},"Gesamt",null,"GUV"]
[{"$nulls":15},"Anzahl","hh:mm","Anzahl","hh:mm"]
[null,"Tauchgang","Datum","Einstieg","Ausstieg","Tiefe","Art","Bemerkung","Zeit",null,"GUV","Gesamt","GUV","Gesamt",null,{"$f":"COUNT(A7:A100)","v":0},{"$f":"M101+N101","v":0},{"$f":"COUNTIF(G7:G100,\"GUV\")","v":0},{"$f":"M101","v":0}]
[{"$nulls":10},"hh:mm","hh:mm"]
[{"$nulls":10},{"$f":"'2033'!$K$101","v":0},{"$f":"'2033'!$L$101","v":0},{"$f":"C2","v":2034}]
[{"$nulls":8},{"$f":"IF(E7>0,E7-D7,0)","v":0},null,{"$f":"IF(G7=\"GUV\",K6+I7,K6)","v":0},{"$f":"L6+I7","v":0},{"$f":"IF(G7=\"GUV\",I7,\" \")","v":" "},{"$f":"IF(G7=\"GUV\",\" \",I7)","v":0}]
[{"$nulls":8},{"$f":"IF(E8>0,E8-D8,0)","v":0},null,{"$f":"IF(G8=\"GUV\",K7+I8,K7)","v":0},{"$f":"L7+I8","v":0},{"$f":"IF(G8=\"GUV\",I8,\" \")","v":" "},{"$f":"IF(G8=\"GUV\",\" \",I8)","v":0}]
[{"$nulls":8},0,null,0,0," ",0]
[{"$nulls":8},0,null,0,0," ",0]
[{"$nulls":8},0,null,0,0," ",0]
[{"$nulls":8},0,null,0,0," ",0]
[{"$nulls":8},0,null,0,0," ",0]
[{"$nulls":8},0,null,0,0," ",0]
[{"$nulls":8},0,null,0,0," ",0]
[{"$nulls":8},0,null,0,0," ",0]
[{"$nulls":8},0,null,0,0," ",0]
[{"$nulls":8},0,null,0,0," ",0]
[{"$nulls":8},0,null,0,0," ",0]
[{"$nulls":8},0,null,0,0," ",0]
[{"$nulls":8},0,null,0,0," ",0]
[{"$nulls":8},0,null,0,0," ",0]
[{"$nulls":8},0,null,0,0," ",0]
[{"$nulls":8},0,null,0,0," ",0]
[{"$nulls":8},0,null,0,0," ",0]
[{"$nulls":8},0,null,0,0," ",0]
[{"$nulls":8},0,null,0,0," ",0]
[{"$nulls":8},0,null,0,0," ",0]
[{"$nulls":8},0,null,0,0," ",0]
[{"$nulls":8},0,null,0,0," ",0]
[{"$nulls":8},0,null,0,0," ",0]
[{"$nulls":8},0,null,0,0," ",0]
[{"$nulls":8},0,null,0,0," ",0]
[{"$nulls":8},0,null,0,0," ",0]
[{"$nulls":8},0,null,0,0," ",0]
[{"$nulls":8},0,null,0,0," ",0]
[{"$nulls":8},0,null,0,0," ",0]
[{"$nulls":8},0,null,0,0," ",0]
[{"$nulls":8},0,null,0,0," ",0]
[{"$nulls":8},0,null,0,0," ",0]
[{"$nulls":8},0,null,0,0," ",0]
[{"$nulls":8},0,null,0,0," ",0]
[{"$nulls":8},0,null,0,0," ",0]
[{"$nulls":8},0,null,0,0," ",0]
[{"$nulls":8},0,null,0,0," ",0]
[{"$nulls":8},0,null,0,0," ",0]
[{"$nulls":8},0,null,0,0," ",0]
[{"$nulls":8},0,null,0,0," ",0]
[{"$nulls":8},0,null,0,0," ",0]
[{"$nulls":8},0,null,0,0," ",0]
[{"$nulls":8},0,null,0,0," ",0]
[{"$nulls":8},0,null,0,0," ",0]
[{"$nulls":8},0,null,0,0," ",0]
[{"$nulls":8},0,null,0,0," ",0]
[{"$nulls":8},0,null,0,0," ",0]
[{"$nulls":8},0,null,0,0," ",0]
[{"$nulls":8},0,null,0,0," ",0]
[{"$nulls":8},0,null,0,0," ",0]
[{"$nulls":8},0,null,0,0," ",0]
[{"$nulls":8},0,null,0,0," ",0]
[{"$nulls":8},0,null,0,0," ",0]
[{"$nulls":8},0,null,0,0," ",0]
[{"$nulls":8},0,null,0,0," ",0]
[{"$nulls":8},0,null,0,0," ",0]
[{"$nulls":8},0,null,0,0," ",0]
[{"$nulls":8},0,null,0,0," ",0]
[{"$nulls":8},0,null,0,0," ",0]
[{"$nulls":8},0,null,0,0," ",0]
[{"$nulls":8},0,null,0,0," ",0]
[{"$nulls":8},0,null,0,0," ",0]
[{"$nulls":8},0,null,0,0," ",0]
[{"$nulls":8},{"$f":"IF(E72>0,E72-D72,0)","v":0},null,{"$f":"IF(G72=\"GUV\",K71+I72,K71)","v":0},{"$f":"L71+I72","v":0},{"$f":"IF(G72=\"GUV\",I72,\" \")","v":" "},{"$f":"IF(G72=\"GUV\",\" \",I72)","v":0}]
[{"$nulls":8},0,null,0,0," ",0]
[{"$nulls":8},0,null,0,0," ",0]
[{"$nulls":8},0,null,0,0," ",0]
[{"$nulls":8},0,null,0,0," ",0]
[{"$nulls":8},0,null,0,0," ",0]
[{"$nulls":8},0,null,0,0," ",0]
[{"$nulls":8},0,null,0,0," ",0]
[{"$nulls":8},0,null,0,0," ",0]
[{"$nulls":8},0,null,0,0," ",0]
[{"$nulls":8},0,null,0,0," ",0]
[{"$nulls":8},0,null,0,0," ",0]
[{"$nulls":8},0,null,0,0," ",0]
[{"$nulls":8},0,null,0,0," ",0]
[{"$nulls":8},0,null,0,0," ",0]
[{"$nulls":8},0,null,0,0," ",0]
[{"$nulls":8},0,null,0,0," ",0]
[{"$nulls":8},0,null,0,0," ",0]
[{"$nulls":8},0,null,0,0," ",0]
[{"$nulls":8},0,null,0,0," ",0]
[{"$nulls":8},0,null,0,0," ",0]
[{"$nulls":8},0,null,0,0," ",0]
[{"$nulls":8},0,null,0,0," ",0]
[{"$nulls":8},0,null,0,0," ",0]
[{"$nulls":8},0,null,0,0," ",0]
[{"$nulls":8},0,null,0,0," ",0]
[{"$nulls":8},0,null,0,0," ",0]
[{"$nulls":8},0,null,0,0," ",0]
[{"$nulls":8},0,null,0,0," ",0]
[{"$nulls":10},{"$f":"MAX(K6:K100)","v":0},{"$f":"MAX(L6:L100)","v":0},{"$f":"SUM(M7:M100)","v":0},{"$f":"SUM(N7:N100)","v":0}]

{"sheet":"2035","index":26,"n_rows":101,"n_cols":19,"rows_kept":101,"merged":[[0,15,0,18],[5,12,5,13]]}
[{"$nulls":15},{"$f":"C2","v":2035}]
[null,null,2035,{"$nulls":12},"Gesamt",null,"GUV"]
[{"$nulls":15},"Anzahl","hh:mm","Anzahl","hh:mm"]
[null,"Tauchgang","Datum","Einstieg","Ausstieg","Tiefe","Art","Bemerkung","Zeit",null,"GUV","Gesamt","GUV","Gesamt",null,{"$f":"COUNT(A7:A100)","v":0},{"$f":"M101+N101","v":0},{"$f":"COUNTIF(G7:G100,\"GUV\")","v":0},{"$f":"M101","v":0}]
[{"$nulls":10},"hh:mm","hh:mm"]
[{"$nulls":10},{"$f":"'2034'!$K$101","v":0},{"$f":"'2034'!$L$101","v":0},{"$f":"C2","v":2035}]
[{"$nulls":8},{"$f":"IF(E7>0,E7-D7,0)","v":0},null,{"$f":"IF(G7=\"GUV\",K6+I7,K6)","v":0},{"$f":"L6+I7","v":0},{"$f":"IF(G7=\"GUV\",I7,\" \")","v":" "},{"$f":"IF(G7=\"GUV\",\" \",I7)","v":0}]
[{"$nulls":8},{"$f":"IF(E8>0,E8-D8,0)","v":0},null,{"$f":"IF(G8=\"GUV\",K7+I8,K7)","v":0},{"$f":"L7+I8","v":0},{"$f":"IF(G8=\"GUV\",I8,\" \")","v":" "},{"$f":"IF(G8=\"GUV\",\" \",I8)","v":0}]
[{"$nulls":8},0,null,0,0," ",0]
[{"$nulls":8},0,null,0,0," ",0]
[{"$nulls":8},0,null,0,0," ",0]
[{"$nulls":8},0,null,0,0," ",0]
[{"$nulls":8},0,null,0,0," ",0]
[{"$nulls":8},0,null,0,0," ",0]
[{"$nulls":8},0,null,0,0," ",0]
[{"$nulls":8},0,null,0,0," ",0]
[{"$nulls":8},0,null,0,0," ",0]
[{"$nulls":8},0,null,0,0," ",0]
[{"$nulls":8},0,null,0,0," ",0]
[{"$nulls":8},0,null,0,0," ",0]
[{"$nulls":8},0,null,0,0," ",0]
[{"$nulls":8},0,null,0,0," ",0]
[{"$nulls":8},0,null,0,0," ",0]
[{"$nulls":8},0,null,0,0," ",0]
[{"$nulls":8},0,null,0,0," ",0]
[{"$nulls":8},0,null,0,0," ",0]
[{"$nulls":8},0,null,0,0," ",0]
[{"$nulls":8},0,null,0,0," ",0]
[{"$nulls":8},0,null,0,0," ",0]
[{"$nulls":8},0,null,0,0," ",0]
[{"$nulls":8},0,null,0,0," ",0]
[{"$nulls":8},0,null,0,0," ",0]
[{"$nulls":8},0,null,0,0," ",0]
[{"$nulls":8},0,null,0,0," ",0]
[{"$nulls":8},0,null,0,0," ",0]
[{"$nulls":8},0,null,0,0," ",0]
[{"$nulls":8},0,null,0,0," ",0]
[{"$nulls":8},0,null,0,0," ",0]
[{"$nulls":8},0,null,0,0," ",0]
[{"$nulls":8},0,null,0,0," ",0]
[{"$nulls":8},0,null,0,0," ",0]
[{"$nulls":8},0,null,0,0," ",0]
[{"$nulls":8},0,null,0,0," ",0]
[{"$nulls":8},0,null,0,0," ",0]
[{"$nulls":8},0,null,0,0," ",0]
[{"$nulls":8},0,null,0,0," ",0]
[{"$nulls":8},0,null,0,0," ",0]
[{"$nulls":8},0,null,0,0," ",0]
[{"$nulls":8},0,null,0,0," ",0]
[{"$nulls":8},0,null,0,0," ",0]
[{"$nulls":8},0,null,0,0," ",0]
[{"$nulls":8},0,null,0,0," ",0]
[{"$nulls":8},0,null,0,0," ",0]
[{"$nulls":8},0,null,0,0," ",0]
[{"$nulls":8},0,null,0,0," ",0]
[{"$nulls":8},0,null,0,0," ",0]
[{"$nulls":8},0,null,0,0," ",0]
[{"$nulls":8},0,null,0,0," ",0]
[{"$nulls":8},0,null,0,0," ",0]
[{"$nulls":8},0,null,0,0," ",0]
[{"$nulls":8},0,null,0,0," ",0]
[{"$nulls":8},0,null,0,0," ",0]
[{"$nulls":8},0,null,0,0," ",0]
[{"$nulls":8},0,null,0,0," ",0]
[{"$nulls":8},0,null,0,0," ",0]
[{"$nulls":8},0,null,0,0," ",0]
[{"$nulls":8},0,null,0,0," ",0]
[{"$nulls":8},0,null,0,0," ",0]
[{"$nulls":8},0,null,0,0," ",0]
[{"$nulls":8},0,null,0,0," ",0]
[{"$nulls":8},0,null,0,0," ",0]
[{"$nulls":8},{"$f":"IF(E72>0,E72-D72,0)","v":0},null,{"$f":"IF(G72=\"GUV\",K71+I72,K71)","v":0},{"$f":"L71+I72","v":0},{"$f":"IF(G72=\"GUV\",I72,\" \")","v":" "},{"$f":"IF(G72=\"GUV\",\" \",I72)","v":0}]
[{"$nulls":8},0,null,0,0," ",0]
[{"$nulls":8},0,null,0,0," ",0]
[{"$nulls":8},0,null,0,0," ",0]
[{"$nulls":8},0,null,0,0," ",0]
[{"$nulls":8},0,null,0,0," ",0]
[{"$nulls":8},0,null,0,0," ",0]
[{"$nulls":8},0,null,0,0," ",0]
[{"$nulls":8},0,null,0,0," ",0]
[{"$nulls":8},0,null,0,0," ",0]
[{"$nulls":8},0,null,0,0," ",0]
[{"$nulls":8},0,null,0,0," ",0]
[{"$nulls":8},0,null,0,0," ",0]
[{"$nulls":8},0,null,0,0," ",0]
[{"$nulls":8},0,null,0,0," ",0]
[{"$nulls":8},0,null,0,0," ",0]
[{"$nulls":8},0,null,0,0," ",0]
[{"$nulls":8},0,null,0,0," ",0]
[{"$nulls":8},0,null,0,0," ",0]
[{"$nulls":8},0,null,0,0," ",0]
[{"$nulls":8},0,null,0,0," ",0]
[{"$nulls":8},0,null,0,0," ",0]
[{"$nulls":8},0,null,0,0," ",0]
[{"$nulls":8},0,null,0,0," ",0]
[{"$nulls":8},0,null,0,0," ",0]
[{"$nulls":8},0,null,0,0," ",0]
[{"$nulls":8},0,null,0,0," ",0]
[{"$nulls":8},0,null,0,0," ",0]
[{"$nulls":8},0,null,0,0," ",0]
[{"$nulls":10},{"$f":"MAX(K6:K100)","v":0},{"$f":"MAX(L6:L100)","v":0},{"$f":"SUM(M7:M100)","v":0},{"$f":"SUM(N7:N100)","v":0}]

{"sheet":"2036","index":27,"n_rows":101,"n_cols":19,"rows_kept":101,"merged":[[0,15,0,18],[5,12,5,13]]}
[{"$nulls":15},{"$f":"C2","v":2036}]
[null,null,2036,{"$nulls":12},"Gesamt",null,"GUV"]
[{"$nulls":15},"Anzahl","hh:mm","Anzahl","hh:mm"]
[null,"Tauchgang","Datum","Einstieg","Ausstieg","Tiefe","Art","Bemerkung","Zeit",null,"GUV","Gesamt","GUV","Gesamt",null,{"$f":"COUNT(A7:A100)","v":0},{"$f":"M101+N101","v":0},{"$f":"COUNTIF(G7:G100,\"GUV\")","v":0},{"$f":"M101","v":0}]
[{"$nulls":10},"hh:mm","hh:mm"]
[{"$nulls":10},{"$f":"'2035'!$K$101","v":0},{"$f":"'2035'!$L$101","v":0},{"$f":"C2","v":2036}]
[{"$nulls":8},{"$f":"IF(E7>0,E7-D7,0)","v":0},null,{"$f":"IF(G7=\"GUV\",K6+I7,K6)","v":0},{"$f":"L6+I7","v":0},{"$f":"IF(G7=\"GUV\",I7,\" \")","v":" "},{"$f":"IF(G7=\"GUV\",\" \",I7)","v":0}]
[{"$nulls":8},{"$f":"IF(E8>0,E8-D8,0)","v":0},null,{"$f":"IF(G8=\"GUV\",K7+I8,K7)","v":0},{"$f":"L7+I8","v":0},{"$f":"IF(G8=\"GUV\",I8,\" \")","v":" "},{"$f":"IF(G8=\"GUV\",\" \",I8)","v":0}]
[{"$nulls":8},0,null,0,0," ",0]
[{"$nulls":8},0,null,0,0," ",0]
[{"$nulls":8},0,null,0,0," ",0]
[{"$nulls":8},0,null,0,0," ",0]
[{"$nulls":8},0,null,0,0," ",0]
[{"$nulls":8},0,null,0,0," ",0]
[{"$nulls":8},0,null,0,0," ",0]
[{"$nulls":8},0,null,0,0," ",0]
[{"$nulls":8},0,null,0,0," ",0]
[{"$nulls":8},0,null,0,0," ",0]
[{"$nulls":8},0,null,0,0," ",0]
[{"$nulls":8},0,null,0,0," ",0]
[{"$nulls":8},0,null,0,0," ",0]
[{"$nulls":8},0,null,0,0," ",0]
[{"$nulls":8},0,null,0,0," ",0]
[{"$nulls":8},0,null,0,0," ",0]
[{"$nulls":8},0,null,0,0," ",0]
[{"$nulls":8},0,null,0,0," ",0]
[{"$nulls":8},0,null,0,0," ",0]
[{"$nulls":8},0,null,0,0," ",0]
[{"$nulls":8},0,null,0,0," ",0]
[{"$nulls":8},0,null,0,0," ",0]
[{"$nulls":8},0,null,0,0," ",0]
[{"$nulls":8},0,null,0,0," ",0]
[{"$nulls":8},0,null,0,0," ",0]
[{"$nulls":8},0,null,0,0," ",0]
[{"$nulls":8},0,null,0,0," ",0]
[{"$nulls":8},0,null,0,0," ",0]
[{"$nulls":8},0,null,0,0," ",0]
[{"$nulls":8},0,null,0,0," ",0]
[{"$nulls":8},0,null,0,0," ",0]
[{"$nulls":8},0,null,0,0," ",0]
[{"$nulls":8},0,null,0,0," ",0]
[{"$nulls":8},0,null,0,0," ",0]
[{"$nulls":8},0,null,0,0," ",0]
[{"$nulls":8},0,null,0,0," ",0]
[{"$nulls":8},0,null,0,0," ",0]
[{"$nulls":8},0,null,0,0," ",0]
[{"$nulls":8},0,null,0,0," ",0]
[{"$nulls":8},0,null,0,0," ",0]
[{"$nulls":8},0,null,0,0," ",0]
[{"$nulls":8},0,null,0,0," ",0]
[{"$nulls":8},0,null,0,0," ",0]
[{"$nulls":8},0,null,0,0," ",0]
[{"$nulls":8},0,null,0,0," ",0]
[{"$nulls":8},0,null,0,0," ",0]
[{"$nulls":8},0,null,0,0," ",0]
[{"$nulls":8},0,null,0,0," ",0]
[{"$nulls":8},0,null,0,0," ",0]
[{"$nulls":8},0,null,0,0," ",0]
[{"$nulls":8},0,null,0,0," ",0]
[{"$nulls":8},0,null,0,0," ",0]
[{"$nulls":8},0,null,0,0," ",0]
[{"$nulls":8},0,null,0,0," ",0]
[{"$nulls":8},0,null,0,0," ",0]
[{"$nulls":8},0,null,0,0," ",0]
[{"$nulls":8},0,null,0,0," ",0]
[{"$nulls":8},0,null,0,0," ",0]
[{"$nulls":8},0,null,0,0," ",0]
[{"$nulls":8},0,null,0,0," ",0]
[{"$nulls":8},0,null,0,0," ",0]
[{"$nulls":8},0,null,0,0," ",0]
[{"$nulls":8},0,null,0,0," ",0]
[{"$nulls":8},{"$f":"IF(E72>0,E72-D72,0)","v":0},null,{"$f":"IF(G72=\"GUV\",K71+I72,K71)","v":0},{"$f":"L71+I72","v":0},{"$f":"IF(G72=\"GUV\",I72,\" \")","v":" "},{"$f":"IF(G72=\"GUV\",\" \",I72)","v":0}]
[{"$nulls":8},0,null,0,0," ",0]
[{"$nulls":8},0,null,0,0," ",0]
[{"$nulls":8},0,null,0,0," ",0]
[{"$nulls":8},0,null,0,0," ",0]
[{"$nulls":8},0,null,0,0," ",0]
[{"$nulls":8},0,null,0,0," ",0]
[{"$nulls":8},0,null,0,0," ",0]
[{"$nulls":8},0,null,0,0," ",0]
[{"$nulls":8},0,null,0,0," ",0]
[{"$nulls":8},0,null,0,0," ",0]
[{"$nulls":8},0,null,0,0," ",0]
[{"$nulls":8},0,null,0,0," ",0]
[{"$nulls":8},0,null,0,0," ",0]
[{"$nulls":8},0,null,0,0," ",0]
[{"$nulls":8},0,null,0,0," ",0]
[{"$nulls":8},0,null,0,0," ",0]
[{"$nulls":8},0,null,0,0," ",0]
[{"$nulls":8},0,null,0,0," ",0]
[{"$nulls":8},0,null,0,0," ",0]
[{"$nulls":8},0,null,0,0," ",0]
[{"$nulls":8},0,null,0,0," ",0]
[{"$nulls":8},0,null,0,0," ",0]
[{"$nulls":8},0,null,0,0," ",0]
[{"$nulls":8},0,null,0,0," ",0]
[{"$nulls":8},0,null,0,0," ",0]
[{"$nulls":8},0,null,0,0," ",0]
[{"$nulls":8},0,null,0,0," ",0]
[{"$nulls":8},0,null,0,0," ",0]
[{"$nulls":10},{"$f":"MAX(K6:K100)","v":0},{"$f":"MAX(L6:L100)","v":0},{"$f":"SUM(M7:M100)","v":0},{"$f":"SUM(N7:N100)","v":0}]

{"sheet":"2037","index":28,"n_rows":101,"n_cols":19,"rows_kept":101,"merged":[[0,15,0,18],[5,12,5,13]]}
[{"$nulls":15},{"$f":"C2","v":2037}]
[null,null,2037,{"$nulls":12},"Gesamt",null,"GUV"]
[{"$nulls":15},"Anzahl","hh:mm","Anzahl","hh:mm"]
[null,"Tauchgang","Datum","Einstieg","Ausstieg","Tiefe","Art","Bemerkung","Zeit",null,"GUV","Gesamt","GUV","Gesamt",null,{"$f":"COUNT(A7:A100)","v":0},{"$f":"M101+N101","v":0},{"$f":"COUNTIF(G7:G100,\"GUV\")","v":0},{"$f":"M101","v":0}]
[{"$nulls":10},"hh:mm","hh:mm"]
[{"$nulls":10},{"$f":"'2036'!$K$101","v":0},{"$f":"'2036'!$L$101","v":0},{"$f":"C2","v":2037}]
[{"$nulls":8},{"$f":"IF(E7>0,E7-D7,0)","v":0},null,{"$f":"IF(G7=\"GUV\",K6+I7,K6)","v":0},{"$f":"L6+I7","v":0},{"$f":"IF(G7=\"GUV\",I7,\" \")","v":" "},{"$f":"IF(G7=\"GUV\",\" \",I7)","v":0}]
[{"$nulls":8},{"$f":"IF(E8>0,E8-D8,0)","v":0},null,{"$f":"IF(G8=\"GUV\",K7+I8,K7)","v":0},{"$f":"L7+I8","v":0},{"$f":"IF(G8=\"GUV\",I8,\" \")","v":" "},{"$f":"IF(G8=\"GUV\",\" \",I8)","v":0}]
[{"$nulls":8},0,null,0,0," ",0]
[{"$nulls":8},0,null,0,0," ",0]
[{"$nulls":8},0,null,0,0," ",0]
[{"$nulls":8},0,null,0,0," ",0]
[{"$nulls":8},0,null,0,0," ",0]
[{"$nulls":8},0,null,0,0," ",0]
[{"$nulls":8},0,null,0,0," ",0]
[{"$nulls":8},0,null,0,0," ",0]
[{"$nulls":8},0,null,0,0," ",0]
[{"$nulls":8},0,null,0,0," ",0]
[{"$nulls":8},0,null,0,0," ",0]
[{"$nulls":8},0,null,0,0," ",0]
[{"$nulls":8},0,null,0,0," ",0]
[{"$nulls":8},0,null,0,0," ",0]
[{"$nulls":8},0,null,0,0," ",0]
[{"$nulls":8},0,null,0,0," ",0]
[{"$nulls":8},0,null,0,0," ",0]
[{"$nulls":8},0,null,0,0," ",0]
[{"$nulls":8},0,null,0,0," ",0]
[{"$nulls":8},0,null,0,0," ",0]
[{"$nulls":8},0,null,0,0," ",0]
[{"$nulls":8},0,null,0,0," ",0]
[{"$nulls":8},0,null,0,0," ",0]
[{"$nulls":8},0,null,0,0," ",0]
[{"$nulls":8},0,null,0,0," ",0]
[{"$nulls":8},0,null,0,0," ",0]
[{"$nulls":8},0,null,0,0," ",0]
[{"$nulls":8},0,null,0,0," ",0]
[{"$nulls":8},0,null,0,0," ",0]
[{"$nulls":8},0,null,0,0," ",0]
[{"$nulls":8},0,null,0,0," ",0]
[{"$nulls":8},0,null,0,0," ",0]
[{"$nulls":8},0,null,0,0," ",0]
[{"$nulls":8},0,null,0,0," ",0]
[{"$nulls":8},0,null,0,0," ",0]
[{"$nulls":8},0,null,0,0," ",0]
[{"$nulls":8},0,null,0,0," ",0]
[{"$nulls":8},0,null,0,0," ",0]
[{"$nulls":8},0,null,0,0," ",0]
[{"$nulls":8},0,null,0,0," ",0]
[{"$nulls":8},0,null,0,0," ",0]
[{"$nulls":8},0,null,0,0," ",0]
[{"$nulls":8},0,null,0,0," ",0]
[{"$nulls":8},0,null,0,0," ",0]
[{"$nulls":8},0,null,0,0," ",0]
[{"$nulls":8},0,null,0,0," ",0]
[{"$nulls":8},0,null,0,0," ",0]
[{"$nulls":8},0,null,0,0," ",0]
[{"$nulls":8},0,null,0,0," ",0]
[{"$nulls":8},0,null,0,0," ",0]
[{"$nulls":8},0,null,0,0," ",0]
[{"$nulls":8},0,null,0,0," ",0]
[{"$nulls":8},0,null,0,0," ",0]
[{"$nulls":8},0,null,0,0," ",0]
[{"$nulls":8},0,null,0,0," ",0]
[{"$nulls":8},0,null,0,0," ",0]
[{"$nulls":8},0,null,0,0," ",0]
[{"$nulls":8},0,null,0,0," ",0]
[{"$nulls":8},0,null,0,0," ",0]
[{"$nulls":8},0,null,0,0," ",0]
[{"$nulls":8},0,null,0,0," ",0]
[{"$nulls":8},0,null,0,0," ",0]
[{"$nulls":8},0,null,0,0," ",0]
[{"$nulls":8},{"$f":"IF(E72>0,E72-D72,0)","v":0},null,{"$f":"IF(G72=\"GUV\",K71+I72,K71)","v":0},{"$f":"L71+I72","v":0},{"$f":"IF(G72=\"GUV\",I72,\" \")","v":" "},{"$f":"IF(G72=\"GUV\",\" \",I72)","v":0}]
[{"$nulls":8},0,null,0,0," ",0]
[{"$nulls":8},0,null,0,0," ",0]
[{"$nulls":8},0,null,0,0," ",0]
[{"$nulls":8},0,null,0,0," ",0]
[{"$nulls":8},0,null,0,0," ",0]
[{"$nulls":8},0,null,0,0," ",0]
[{"$nulls":8},0,null,0,0," ",0]
[{"$nulls":8},0,null,0,0," ",0]
[{"$nulls":8},0,null,0,0," ",0]
[{"$nulls":8},0,null,0,0," ",0]
[{"$nulls":8},0,null,0,0," ",0]
[{"$nulls":8},0,null,0,0," ",0]
[{"$nulls":8},0,null,0,0," ",0]
[{"$nulls":8},0,null,0,0," ",0]
[{"$nulls":8},0,null,0,0," ",0]
[{"$nulls":8},0,null,0,0," ",0]
[{"$nulls":8},0,null,0,0," ",0]
[{"$nulls":8},0,null,0,0," ",0]
[{"$nulls":8},0,null,0,0," ",0]
[{"$nulls":8},0,null,0,0," ",0]
[{"$nulls":8},0,null,0,0," ",0]
[{"$nulls":8},0,null,0,0," ",0]
[{"$nulls":8},0,null,0,0," ",0]
[{"$nulls":8},0,null,0,0," ",0]
[{"$nulls":8},0,null,0,0," ",0]
[{"$nulls":8},0,null,0,0," ",0]
[{"$nulls":8},0,null,0,0," ",0]
[{"$nulls":8},0,null,0,0," ",0]
[{"$nulls":10},{"$f":"MAX(K6:K100)","v":0},{"$f":"MAX(L6:L100)","v":0},{"$f":"SUM(M7:M100)","v":0},{"$f":"SUM(N7:N100)","v":0}]

{"sheet":"2038","index":29,"n_rows":101,"n_cols":19,"rows_kept":101,"merged":[[0,15,0,18],[5,12,5,13]]}
[{"$nulls":15},{"$f":"C2","v":2038}]
[null,null,2038,{"$nulls":12},"Gesamt",null,"GUV"]
[{"$nulls":15},"Anzahl","hh:mm","Anzahl","hh:mm"]
[null,"Tauchgang","Datum","Einstieg","Ausstieg","Tiefe","Art","Bemerkung","Zeit",null,"GUV","Gesamt","GUV","Gesamt",null,{"$f":"COUNT(A7:A100)","v":0},{"$f":"M101+N101","v":0},{"$f":"COUNTIF(G7:G100,\"GUV\")","v":0},{"$f":"M101","v":0}]
[{"$nulls":10},"hh:mm","hh:mm"]
[{"$nulls":10},{"$f":"'2037'!$K$101","v":0},{"$f":"'2037'!$L$101","v":0},{"$f":"C2","v":2038}]
[{"$nulls":8},{"$f":"IF(E7>0,E7-D7,0)","v":0},null,{"$f":"IF(G7=\"GUV\",K6+I7,K6)","v":0},{"$f":"L6+I7","v":0},{"$f":"IF(G7=\"GUV\",I7,\" \")","v":" "},{"$f":"IF(G7=\"GUV\",\" \",I7)","v":0}]
[{"$nulls":8},{"$f":"IF(E8>0,E8-D8,0)","v":0},null,{"$f":"IF(G8=\"GUV\",K7+I8,K7)","v":0},{"$f":"L7+I8","v":0},{"$f":"IF(G8=\"GUV\",I8,\" \")","v":" "},{"$f":"IF(G8=\"GUV\",\" \",I8)","v":0}]
[{"$nulls":8},0,null,0,0," ",0]
[{"$nulls":8},0,null,0,0," ",0]
[{"$nulls":8},0,null,0,0," ",0]
[{"$nulls":8},0,null,0,0," ",0]
[{"$nulls":8},0,null,0,0," ",0]
[{"$nulls":8},0,null,0,0," ",0]
[{"$nulls":8},0,null,0,0," ",0]
[{"$nulls":8},0,null,0,0," ",0]
[{"$nulls":8},0,null,0,0," ",0]
[{"$nulls":8},0,null,0,0," ",0]
[{"$nulls":8},0,null,0,0," ",0]
[{"$nulls":8},0,null,0,0," ",0]
[{"$nulls":8},0,null,0,0," ",0]
[{"$nulls":8},0,null,0,0," ",0]
[{"$nulls":8},0,null,0,0," ",0]
[{"$nulls":8},0,null,0,0," ",0]
[{"$nulls":8},0,null,0,0," ",0]
[{"$nulls":8},0,null,0,0," ",0]
[{"$nulls":8},0,null,0,0," ",0]
[{"$nulls":8},0,null,0,0," ",0]
[{"$nulls":8},0,null,0,0," ",0]
[{"$nulls":8},0,null,0,0," ",0]
[{"$nulls":8},0,null,0,0," ",0]
[{"$nulls":8},0,null,0,0," ",0]
[{"$nulls":8},0,null,0,0," ",0]
[{"$nulls":8},0,null,0,0," ",0]
[{"$nulls":8},0,null,0,0," ",0]
[{"$nulls":8},0,null,0,0," ",0]
[{"$nulls":8},0,null,0,0," ",0]
[{"$nulls":8},0,null,0,0," ",0]
[{"$nulls":8},0,null,0,0," ",0]
[{"$nulls":8},0,null,0,0," ",0]
[{"$nulls":8},0,null,0,0," ",0]
[{"$nulls":8},0,null,0,0," ",0]
[{"$nulls":8},0,null,0,0," ",0]
[{"$nulls":8},0,null,0,0," ",0]
[{"$nulls":8},0,null,0,0," ",0]
[{"$nulls":8},0,null,0,0," ",0]
[{"$nulls":8},0,null,0,0," ",0]
[{"$nulls":8},0,null,0,0," ",0]
[{"$nulls":8},0,null,0,0," ",0]
[{"$nulls":8},0,null,0,0," ",0]
[{"$nulls":8},0,null,0,0," ",0]
[{"$nulls":8},0,null,0,0," ",0]
[{"$nulls":8},0,null,0,0," ",0]
[{"$nulls":8},0,null,0,0," ",0]
[{"$nulls":8},0,null,0,0," ",0]
[{"$nulls":8},0,null,0,0," ",0]
[{"$nulls":8},0,null,0,0," ",0]
[{"$nulls":8},0,null,0,0," ",0]
[{"$nulls":8},0,null,0,0," ",0]
[{"$nulls":8},0,null,0,0," ",0]
[{"$nulls":8},0,null,0,0," ",0]
[{"$nulls":8},0,null,0,0," ",0]
[{"$nulls":8},0,null,0,0," ",0]
[{"$nulls":8},0,null,0,0," ",0]
[{"$nulls":8},0,null,0,0," ",0]
[{"$nulls":8},0,null,0,0," ",0]
[{"$nulls":8},0,null,0,0," ",0]
[{"$nulls":8},0,null,0,0," ",0]
[{"$nulls":8},0,null,0,0," ",0]
[{"$nulls":8},0,null,0,0," ",0]
[{"$nulls":8},0,null,0,0," ",0]
[{"$nulls":8},{"$f":"IF(E72>0,E72-D72,0)","v":0},null,{"$f":"IF(G72=\"GUV\",K71+I72,K71)","v":0},{"$f":"L71+I72","v":0},{"$f":"IF(G72=\"GUV\",I72,\" \")","v":" "},{"$f":"IF(G72=\"GUV\",\" \",I72)","v":0}]
[{"$nulls":8},0,null,0,0," ",0]
[{"$nulls":8},0,null,0,0," ",0]
[{"$nulls":8},0,null,0,0," ",0]
[{"$nulls":8},0,null,0,0," ",0]
[{"$nulls":8},0,null,0,0," ",0]
[{"$nulls":8},0,null,0,0," ",0]
[{"$nulls":8},0,null,0,0," ",0]
[{"$nulls":8},0,null,0,0," ",0]
[{"$nulls":8},0,null,0,0," ",0]
[{"$nulls":8},0,null,0,0," ",0]
[{"$nulls":8},0,null,0,0," ",0]
[{"$nulls":8},0,null,0,0," ",0]
[{"$nulls":8},0,null,0,0," ",0]
[{"$nulls":8},0,null,0,0," ",0]
[{"$nulls":8},0,null,0,0," ",0]
[{"$nulls":8},0,null,0,0," ",0]
[{"$nulls":8},0,null,0,0," ",0]
[{"$nulls":8},0,null,0,0," ",0]
[{"$nulls":8},0,null,0,0," ",0]
[{"$nulls":8},0,null,0,0," ",0]
[{"$nulls":8},0,null,0,0," ",0]
[{"$nulls":8},0,null,0,0," ",0]
[{"$nulls":8},0,null,0,0," ",0]
[{"$nulls":8},0,null,0,0," ",0]
[{"$nulls":8},0,null,0,0," ",0]
[{"$nulls":8},0,null,0,0," ",0]
[{"$nulls":8},0,null,0,0," ",0]
[{"$nulls":8},0,null,0,0," ",0]
[{"$nulls":10},{"$f":"MAX(K6:K100)","v":0},{"$f":"MAX(L6:L100)","v":0},{"$f":"SUM(M7:M100)","v":0},{"$f":"SUM(N7:N100)","v":0}]

{"sheet":"2039","index":30,"n_rows":101,"n_cols":19,"rows_kept":101,"merged":[[0,15,0,18],[5,12,5,13]]}
[{"$nulls":15},{"$f":"C2","v":2039}]
[null,null,2039,{"$nulls":12},"Gesamt",null,"GUV"]
[{"$nulls":15},"Anzahl","hh:mm","Anzahl","hh:mm"]
[null,"Tauchgang","Datum","Einstieg","Ausstieg","Tiefe","Art","Bemerkung","Zeit",null,"GUV","Gesamt","GUV","Gesamt",null,{"$f":"COUNT(A7:A100)","v":0},{"$f":"M101+N101","v":0},{"$f":"COUNTIF(G7:G100,\"GUV\")","v":0},{"$f":"M101","v":0}]
[{"$nulls":10},"hh:mm","hh:mm"]
[{"$nulls":10},{"$f":"'2038'!$K$101","v":0},{"$f":"'2038'!$L$101","v":0},{"$f":"C2","v":2039}]
[{"$nulls":8},{"$f":"IF(E7>0,E7-D7,0)","v":0},null,{"$f":"IF(G7=\"GUV\",K6+I7,K6)","v":0},{"$f":"L6+I7","v":0},{"$f":"IF(G7=\"GUV\",I7,\" \")","v":" "},{"$f":"IF(G7=\"GUV\",\" \",I7)","v":0}]
[{"$nulls":8},{"$f":"IF(E8>0,E8-D8,0)","v":0},null,{"$f":"IF(G8=\"GUV\",K7+I8,K7)","v":0},{"$f":"L7+I8","v":0},{"$f":"IF(G8=\"GUV\",I8,\" \")","v":" "},{"$f":"IF(G8=\"GUV\",\" \",I8)","v":0}]
[{"$nulls":8},0,null,0,0," ",0]
[{"$nulls":8},0,null,0,0," ",0]
[{"$nulls":8},0,null,0,0," ",0]
[{"$nulls":8},0,null,0,0," ",0]
[{"$nulls":8},0,null,0,0," ",0]
[{"$nulls":8},0,null,0,0," ",0]
[{"$nulls":8},0,null,0,0," ",0]
[{"$nulls":8},0,null,0,0," ",0]
[{"$nulls":8},0,null,0,0," ",0]
[{"$nulls":8},0,null,0,0," ",0]
[{"$nulls":8},0,null,0,0," ",0]
[{"$nulls":8},0,null,0,0," ",0]
[{"$nulls":8},0,null,0,0," ",0]
[{"$nulls":8},0,null,0,0," ",0]
[{"$nulls":8},0,null,0,0," ",0]
[{"$nulls":8},0,null,0,0," ",0]
[{"$nulls":8},0,null,0,0," ",0]
[{"$nulls":8},0,null,0,0," ",0]
[{"$nulls":8},0,null,0,0," ",0]
[{"$nulls":8},0,null,0,0," ",0]
[{"$nulls":8},0,null,0,0," ",0]
[{"$nulls":8},0,null,0,0," ",0]
[{"$nulls":8},0,null,0,0," ",0]
[{"$nulls":8},0,null,0,0," ",0]
[{"$nulls":8},0,null,0,0," ",0]
[{"$nulls":8},0,null,0,0," ",0]
[{"$nulls":8},0,null,0,0," ",0]
[{"$nulls":8},0,null,0,0," ",0]
[{"$nulls":8},0,null,0,0," ",0]
[{"$nulls":8},0,null,0,0," ",0]
[{"$nulls":8},0,null,0,0," ",0]
[{"$nulls":8},0,null,0,0," ",0]
[{"$nulls":8},0,null,0,0," ",0]
[{"$nulls":8},0,null,0,0," ",0]
[{"$nulls":8},0,null,0,0," ",0]
[{"$nulls":8},0,null,0,0," ",0]
[{"$nulls":8},0,null,0,0," ",0]
[{"$nulls":8},0,null,0,0," ",0]
[{"$nulls":8},0,null,0,0," ",0]
[{"$nulls":8},0,null,0,0," ",0]
[{"$nulls":8},0,null,0,0," ",0]
[{"$nulls":8},0,null,0,0," ",0]
[{"$nulls":8},0,null,0,0," ",0]
[{"$nulls":8},0,null,0,0," ",0]
[{"$nulls":8},0,null,0,0," ",0]
[{"$nulls":8},0,null,0,0," ",0]
[{"$nulls":8},0,null,0,0," ",0]
[{"$nulls":8},0,null,0,0," ",0]
[{"$nulls":8},0,null,0,0," ",0]
[{"$nulls":8},0,null,0,0," ",0]
[{"$nulls":8},0,null,0,0," ",0]
[{"$nulls":8},0,null,0,0," ",0]
[{"$nulls":8},0,null,0,0," ",0]
[{"$nulls":8},0,null,0,0," ",0]
[{"$nulls":8},0,null,0,0," ",0]
[{"$nulls":8},0,null,0,0," ",0]
[{"$nulls":8},0,null,0,0," ",0]
[{"$nulls":8},0,null,0,0," ",0]
[{"$nulls":8},0,null,0,0," ",0]
[{"$nulls":8},0,null,0,0," ",0]
[{"$nulls":8},0,null,0,0," ",0]
[{"$nulls":8},0,null,0,0," ",0]
[{"$nulls":8},0,null,0,0," ",0]
[{"$nulls":8},{"$f":"IF(E72>0,E72-D72,0)","v":0},null,{"$f":"IF(G72=\"GUV\",K71+I72,K71)","v":0},{"$f":"L71+I72","v":0},{"$f":"IF(G72=\"GUV\",I72,\" \")","v":" "},{"$f":"IF(G72=\"GUV\",\" \",I72)","v":0}]
[{"$nulls":8},0,null,0,0," ",0]
[{"$nulls":8},0,null,0,0," ",0]
[{"$nulls":8},0,null,0,0," ",0]
[{"$nulls":8},0,null,0,0," ",0]
[{"$nulls":8},0,null,0,0," ",0]
[{"$nulls":8},0,null,0,0," ",0]
[{"$nulls":8},0,null,0,0," ",0]
[{"$nulls":8},0,null,0,0," ",0]
[{"$nulls":8},0,null,0,0," ",0]
[{"$nulls":8},0,null,0,0," ",0]
[{"$nulls":8},0,null,0,0," ",0]
[{"$nulls":8},0,null,0,0," ",0]
[{"$nulls":8},0,null,0,0," ",0]
[{"$nulls":8},0,null,0,0," ",0]
[{"$nulls":8},0,null,0,0," ",0]
[{"$nulls":8},0,null,0,0," ",0]
[{"$nulls":8},0,null,0,0," ",0]
[{"$nulls":8},0,null,0,0," ",0]
[{"$nulls":8},0,null,0,0," ",0]
[{"$nulls":8},0,null,0,0," ",0]
[{"$nulls":8},0,null,0,0," ",0]
[{"$nulls":8},0,null,0,0," ",0]
[{"$nulls":8},0,null,0,0," ",0]
[{"$nulls":8},0,null,0,0," ",0]
[{"$nulls":8},0,null,0,0," ",0]
[{"$nulls":8},0,null,0,0," ",0]
[{"$nulls":8},0,null,0,0," ",0]
[{"$nulls":8},0,null,0,0," ",0]
[{"$nulls":10},{"$f":"MAX(K6:K100)","v":0},{"$f":"MAX(L6:L100)","v":0},{"$f":"SUM(M7:M100)","v":0},{"$f":"SUM(N7:N100)","v":0}]

{"sheet":"2040","index":31,"n_rows":101,"n_cols":19,"rows_kept":101,"merged":[[0,15,0,18],[5,12,5,13]]}
[{"$nulls":15},{"$f":"C2","v":2040}]
[null,null,2040,{"$nulls":12},"Gesamt",null,"GUV"]
[{"$nulls":15},"Anzahl","hh:mm","Anzahl","hh:mm"]
[null,"Tauchgang","Datum","Einstieg","Ausstieg","Tiefe","Art","Bemerkung","Zeit",null,"GUV","Gesamt","GUV","Gesamt",null,{"$f":"COUNT(A7:A100)","v":0},{"$f":"M101+N101","v":0},{"$f":"COUNTIF(G7:G100,\"GUV\")","v":0},{"$f":"M101","v":0}]
[{"$nulls":10},"hh:mm","hh:mm"]
[{"$nulls":10},{"$f":"'2039'!$K$101","v":0},{"$f":"'2039'!$L$101","v":0},{"$f":"C2","v":2040}]
[{"$nulls":8},{"$f":"IF(E7>0,E7-D7,0)","v":0},null,{"$f":"IF(G7=\"GUV\",K6+I7,K6)","v":0},{"$f":"L6+I7","v":0},{"$f":"IF(G7=\"GUV\",I7,\" \")","v":" "},{"$f":"IF(G7=\"GUV\",\" \",I7)","v":0}]
[{"$nulls":8},{"$f":"IF(E8>0,E8-D8,0)","v":0},null,{"$f":"IF(G8=\"GUV\",K7+I8,K7)","v":0},{"$f":"L7+I8","v":0},{"$f":"IF(G8=\"GUV\",I8,\" \")","v":" "},{"$f":"IF(G8=\"GUV\",\" \",I8)","v":0}]
[{"$nulls":8},0,null,0,0," ",0]
[{"$nulls":8},0,null,0,0," ",0]
[{"$nulls":8},0,null,0,0," ",0]
[{"$nulls":8},0,null,0,0," ",0]
[{"$nulls":8},0,null,0,0," ",0]
[{"$nulls":8},0,null,0,0," ",0]
[{"$nulls":8},0,null,0,0," ",0]
[{"$nulls":8},0,null,0,0," ",0]
[{"$nulls":8},0,null,0,0," ",0]
[{"$nulls":8},0,null,0,0," ",0]
[{"$nulls":8},0,null,0,0," ",0]
[{"$nulls":8},0,null,0,0," ",0]
[{"$nulls":8},0,null,0,0," ",0]
[{"$nulls":8},0,null,0,0," ",0]
[{"$nulls":8},0,null,0,0," ",0]
[{"$nulls":8},0,null,0,0," ",0]
[{"$nulls":8},0,null,0,0," ",0]
[{"$nulls":8},0,null,0,0," ",0]
[{"$nulls":8},0,null,0,0," ",0]
[{"$nulls":8},0,null,0,0," ",0]
[{"$nulls":8},0,null,0,0," ",0]
[{"$nulls":8},0,null,0,0," ",0]
[{"$nulls":8},0,null,0,0," ",0]
[{"$nulls":8},0,null,0,0," ",0]
[{"$nulls":8},0,null,0,0," ",0]
[{"$nulls":8},0,null,0,0," ",0]
[{"$nulls":8},0,null,0,0," ",0]
[{"$nulls":8},0,null,0,0," ",0]
[{"$nulls":8},0,null,0,0," ",0]
[{"$nulls":8},0,null,0,0," ",0]
[{"$nulls":8},0,null,0,0," ",0]
[{"$nulls":8},0,null,0,0," ",0]
[{"$nulls":8},0,null,0,0," ",0]
[{"$nulls":8},0,null,0,0," ",0]
[{"$nulls":8},0,null,0,0," ",0]
[{"$nulls":8},0,null,0,0," ",0]
[{"$nulls":8},0,null,0,0," ",0]
[{"$nulls":8},0,null,0,0," ",0]
[{"$nulls":8},0,null,0,0," ",0]
[{"$nulls":8},0,null,0,0," ",0]
[{"$nulls":8},0,null,0,0," ",0]
[{"$nulls":8},0,null,0,0," ",0]
[{"$nulls":8},0,null,0,0," ",0]
[{"$nulls":8},0,null,0,0," ",0]
[{"$nulls":8},0,null,0,0," ",0]
[{"$nulls":8},0,null,0,0," ",0]
[{"$nulls":8},0,null,0,0," ",0]
[{"$nulls":8},0,null,0,0," ",0]
[{"$nulls":8},0,null,0,0," ",0]
[{"$nulls":8},0,null,0,0," ",0]
[{"$nulls":8},0,null,0,0," ",0]
[{"$nulls":8},0,null,0,0," ",0]
[{"$nulls":8},0,null,0,0," ",0]
[{"$nulls":8},0,null,0,0," ",0]
[{"$nulls":8},0,null,0,0," ",0]
[{"$nulls":8},0,null,0,0," ",0]
[{"$nulls":8},0,null,0,0," ",0]
[{"$nulls":8},0,null,0,0," ",0]
[{"$nulls":8},0,null,0,0," ",0]
[{"$nulls":8},0,null,0,0," ",0]
[{"$nulls":8},0,null,0,0," ",0]
[{"$nulls":8},0,null,0,0," ",0]
[{"$nulls":8},0,null,0,0," ",0]
[{"$nulls":8},{"$f":"IF(E72>0,E72-D72,0)","v":0},null,{"$f":"IF(G72=\"GUV\",K71+I72,K71)","v":0},{"$f":"L71+I72","v":0},{"$f":"IF(G72=\"GUV\",I72,\" \")","v":" "},{"$f":"IF(G72=\"GUV\",\" \",I72)","v":0}]
[{"$nulls":8},0,null,0,0," ",0]
[{"$nulls":8},0,null,0,0," ",0]
[{"$nulls":8},0,null,0,0," ",0]
[{"$nulls":8},0,null,0,0," ",0]
[{"$nulls":8},0,null,0,0," ",0]
[{"$nulls":8},0,null,0,0," ",0]
[{"$nulls":8},0,null,0,0," ",0]
[{"$nulls":8},0,null,0,0," ",0]
[{"$nulls":8},0,null,0,0," ",0]
[{"$nulls":8},0,null,0,0," ",0]
[{"$nulls":8},0,null,0,0," ",0]
[{"$nulls":8},0,null,0,0," ",0]
[{"$nulls":8},0,null,0,0," ",0]
[{"$nulls":8},0,null,0,0," ",0]
[{"$nulls":8},0,null,0,0," ",0]
[{"$nulls":8},0,null,0,0," ",0]
[{"$nulls":8},0,null,0,0," ",0]
[{"$nulls":8},0,null,0,0," ",0]
[{"$nulls":8},0,null,0,0," ",0]
[{"$nulls":8},0,null,0,0," ",0]
[{"$nulls":8},0,null,0,0," ",0]
[{"$nulls":8},0,null,0,0," ",0]
[{"$nulls":8},0,null,0,0," ",0]
[{"$nulls":8},0,null,0,0," ",0]
[{"$nulls":8},0,null,0,0," ",0]
[{"$nulls":8},0,null,0,0," ",0]
[{"$nulls":8},0,null,0,0," ",0]
[{"$nulls":8},0,null,0,0," ",0]
[{"$nulls":10},{"$f":"MAX(K6:K100)","v":0},{"$f":"MAX(L6:L100)","v":0},{"$f":"SUM(M7:M100)","v":0},{"$f":"SUM(N7:N100)","v":0}]

{"sheet":"2041","index":32,"n_rows":101,"n_cols":19,"rows_kept":101,"merged":[[0,15,0,18],[5,12,5,13]]}
[{"$nulls":15},{"$f":"C2","v":2041}]
[null,null,2041,{"$nulls":12},"Gesamt",null,"GUV"]
[{"$nulls":15},"Anzahl","hh:mm","Anzahl","hh:mm"]
[null,"Tauchgang","Datum","Einstieg","Ausstieg","Tiefe","Art","Bemerkung","Zeit",null,"GUV","Gesamt","GUV","Gesamt",null,{"$f":"COUNT(A7:A100)","v":0},{"$f":"M101+N101","v":0},{"$f":"COUNTIF(G7:G100,\"GUV\")","v":0},{"$f":"M101","v":0}]
[{"$nulls":10},"hh:mm","hh:mm"]
[{"$nulls":10},{"$f":"'2040'!$K$101","v":0},{"$f":"'2040'!$L$101","v":0},{"$f":"C2","v":2041}]
[{"$nulls":8},{"$f":"IF(E7>0,E7-D7,0)","v":0},null,{"$f":"IF(G7=\"GUV\",K6+I7,K6)","v":0},{"$f":"L6+I7","v":0},{"$f":"IF(G7=\"GUV\",I7,\" \")","v":" "},{"$f":"IF(G7=\"GUV\",\" \",I7)","v":0}]
[{"$nulls":8},{"$f":"IF(E8>0,E8-D8,0)","v":0},null,{"$f":"IF(G8=\"GUV\",K7+I8,K7)","v":0},{"$f":"L7+I8","v":0},{"$f":"IF(G8=\"GUV\",I8,\" \")","v":" "},{"$f":"IF(G8=\"GUV\",\" \",I8)","v":0}]
[{"$nulls":8},0,null,0,0," ",0]
[{"$nulls":8},0,null,0,0," ",0]
[{"$nulls":8},0,null,0,0," ",0]
[{"$nulls":8},0,null,0,0," ",0]
[{"$nulls":8},0,null,0,0," ",0]
[{"$nulls":8},0,null,0,0," ",0]
[{"$nulls":8},0,null,0,0," ",0]
[{"$nulls":8},0,null,0,0," ",0]
[{"$nulls":8},0,null,0,0," ",0]
[{"$nulls":8},0,null,0,0," ",0]
[{"$nulls":8},0,null,0,0," ",0]
[{"$nulls":8},0,null,0,0," ",0]
[{"$nulls":8},0,null,0,0," ",0]
[{"$nulls":8},0,null,0,0," ",0]
[{"$nulls":8},0,null,0,0," ",0]
[{"$nulls":8},0,null,0,0," ",0]
[{"$nulls":8},0,null,0,0," ",0]
[{"$nulls":8},0,null,0,0," ",0]
[{"$nulls":8},0,null,0,0," ",0]
[{"$nulls":8},0,null,0,0," ",0]
[{"$nulls":8},0,null,0,0," ",0]
[{"$nulls":8},0,null,0,0," ",0]
[{"$nulls":8},0,null,0,0," ",0]
[{"$nulls":8},0,null,0,0," ",0]
[{"$nulls":8},0,null,0,0," ",0]
[{"$nulls":8},0,null,0,0," ",0]
[{"$nulls":8},0,null,0,0," ",0]
[{"$nulls":8},0,null,0,0," ",0]
[{"$nulls":8},0,null,0,0," ",0]
[{"$nulls":8},0,null,0,0," ",0]
[{"$nulls":8},0,null,0,0," ",0]
[{"$nulls":8},0,null,0,0," ",0]
[{"$nulls":8},0,null,0,0," ",0]
[{"$nulls":8},0,null,0,0," ",0]
[{"$nulls":8},0,null,0,0," ",0]
[{"$nulls":8},0,null,0,0," ",0]
[{"$nulls":8},0,null,0,0," ",0]
[{"$nulls":8},0,null,0,0," ",0]
[{"$nulls":8},0,null,0,0," ",0]
[{"$nulls":8},0,null,0,0," ",0]
[{"$nulls":8},0,null,0,0," ",0]
[{"$nulls":8},0,null,0,0," ",0]
[{"$nulls":8},0,null,0,0," ",0]
[{"$nulls":8},0,null,0,0," ",0]
[{"$nulls":8},0,null,0,0," ",0]
[{"$nulls":8},0,null,0,0," ",0]
[{"$nulls":8},0,null,0,0," ",0]
[{"$nulls":8},0,null,0,0," ",0]
[{"$nulls":8},0,null,0,0," ",0]
[{"$nulls":8},0,null,0,0," ",0]
[{"$nulls":8},0,null,0,0," ",0]
[{"$nulls":8},0,null,0,0," ",0]
[{"$nulls":8},0,null,0,0," ",0]
[{"$nulls":8},0,null,0,0," ",0]
[{"$nulls":8},0,null,0,0," ",0]
[{"$nulls":8},0,null,0,0," ",0]
[{"$nulls":8},0,null,0,0," ",0]
[{"$nulls":8},0,null,0,0," ",0]
[{"$nulls":8},0,null,0,0," ",0]
[{"$nulls":8},0,null,0,0," ",0]
[{"$nulls":8},0,null,0,0," ",0]
[{"$nulls":8},0,null,0,0," ",0]
[{"$nulls":8},0,null,0,0," ",0]
[{"$nulls":8},{"$f":"IF(E72>0,E72-D72,0)","v":0},null,{"$f":"IF(G72=\"GUV\",K71+I72,K71)","v":0},{"$f":"L71+I72","v":0},{"$f":"IF(G72=\"GUV\",I72,\" \")","v":" "},{"$f":"IF(G72=\"GUV\",\" \",I72)","v":0}]
[{"$nulls":8},0,null,0,0," ",0]
[{"$nulls":8},0,null,0,0," ",0]
[{"$nulls":8},0,null,0,0," ",0]
[{"$nulls":8},0,null,0,0," ",0]
[{"$nulls":8},0,null,0,0," ",0]
[{"$nulls":8},0,null,0,0," ",0]
[{"$nulls":8},0,null,0,0," ",0]
[{"$nulls":8},0,null,0,0," ",0]
[{"$nulls":8},0,null,0,0," ",0]
[{"$nulls":8},0,null,0,0," ",0]
[{"$nulls":8},0,null,0,0," ",0]
[{"$nulls":8},0,null,0,0," ",0]
[{"$nulls":8},0,null,0,0," ",0]
[{"$nulls":8},0,null,0,0," ",0]
[{"$nulls":8},0,null,0,0," ",0]
[{"$nulls":8},0,null,0,0," ",0]
[{"$nulls":8},0,null,0,0," ",0]
[{"$nulls":8},0,null,0,0," ",0]
[{"$nulls":8},0,null,0,0," ",0]
[{"$nulls":8},0,null,0,0," ",0]
[{"$nulls":8},0,null,0,0," ",0]
[{"$nulls":8},0,null,0,0," ",0]
[{"$nulls":8},0,null,0,0," ",0]
[{"$nulls":8},0,null,0,0," ",0]
[{"$nulls":8},0,null,0,0," ",0]
[{"$nulls":8},0,null,0,0," ",0]
[{"$nulls":8},0,null,0,0," ",0]
[{"$nulls":8},0,null,0,0," ",0]
[{"$nulls":10},{"$f":"MAX(K6:K100)","v":0},{"$f":"MAX(L6:L100)","v":0},{"$f":"SUM(M7:M100)","v":0},{"$f":"SUM(N7:N100)","v":0}]

{"sheet":"total","index":33,"n_rows":43,"n_cols":11,"rows_kept":43,"merged":[[3,3,3,6],[3,7,3,10],[4,3,4,4],[4,5,4,6],[4,7,4,8],[4,9,4,10]]}
[]
[]
[]
["Jahr","von","bis","Total",{"$nulls":3}," davon GUV"]
[{"$nulls":3},"Anzahl",null,"Stunden",null,"Anzahl",null,"Stunden"]
[{"$nulls":3},"p.a.","S","HH:MM","S","p.a.","S","HH:MM","S"]
["Beginn",null,null,{"$f":"Beginn!F18","v":0},{"$f":"D7+0","v":0},{"$f":"Beginn!F19","v":0},{"$f":"F7","v":0},{"$f":"Beginn!F13","v":0},{"$f":"H7","v":0},{"$f":"Beginn!F14","v":0},{"$f":"J7","v":0}]
[{"$f":"'2010'!C2","v":2010},{"$f":"MIN('2010'!$C$7:$C$100)","v":"00:00:00"},{"$f":"MAX('2010'!$C$7:$C$100)","v":"00:00:00"},{"$f":"'2010'!$P$4","v":0},{"$f":"D8+E7","v":0},{"$f":"'2010'!$Q$4","v":0},{"$f":"G7+F8","v":0},{"$f":"'2010'!$R$4","v":0},{"$f":"I7+H8","v":0},{"$f":"'2010'!$S$4","v":0},{"$f":"K7+J8","v":0}]
[{"$f":"'2011'!C2","v":2011},{"$f":"MIN('2011'!$C$7:$C$100)","v":"00:00:00"},{"$f":"MAX('2011'!$C$7:$C$100)","v":"00:00:00"},{"$f":"'2011'!$P$4","v":0},0,{"$f":"'2011'!$Q$4","v":0},0,{"$f":"'2011'!$R$4","v":0},0,{"$f":"'2011'!$S$4","v":0},0]
[{"$f":"'2012'!C2","v":2012},{"$f":"MIN('2012'!$C$7:$C$100)","v":"00:00:00"},{"$f":"MAX('2012'!$C$7:$C$100)","v":"00:00:00"},{"$f":"'2012'!$P$4","v":0},0,{"$f":"'2012'!$Q$4","v":0},0,{"$f":"'2012'!$R$4","v":0},0,{"$f":"'2012'!$S$4","v":0},0]
[{"$f":"'2013'!C2","v":2013},{"$f":"MIN('2013'!$C$7:$C$100)","v":"00:00:00"},{"$f":"MAX('2013'!C7:C100)","v":"00:00:00"},{"$f":"'2013'!$P$4","v":0},0,{"$f":"'2013'!$Q$4","v":0},0,{"$f":"'2013'!$R$4","v":0},0,{"$f":"'2013'!$S$4","v":0},0]
[{"$f":"'2014'!C2","v":2014},{"$f":"MIN('2014'!$C$7:$C$100)","v":"00:00:00"},{"$f":"MAX('2014'!$C$7:$C$100)","v":"00:00:00"},{"$f":"'2014'!$P$4","v":0},0,{"$f":"'2014'!$Q$4","v":0},0,{"$f":"'2014'!$R$4","v":0},0,{"$f":"'2014'!$S$4","v":0},0]
[{"$f":"'2015'!C2","v":2015},{"$f":"MIN('2015'!$C$7:$C$100)","v":"00:00:00"},{"$f":"MAX('2015'!$C$7:$C$100)","v":"00:00:00"},{"$f":"'2015'!$P$4","v":0},0,{"$f":"'2015'!$Q$4","v":0},0,{"$f":"'2015'!$R$4","v":0},0,{"$f":"'2015'!$S$4","v":0},0]
[{"$f":"'2016'!C2","v":2016},{"$f":"MIN('2016'!$C$7:$C$100)","v":"00:00:00"},{"$f":"MAX('2016'!$C$7:$C$100)","v":"00:00:00"},{"$f":"'2016'!$P$4","v":0},{"$f":"D14+E13","v":0},{"$f":"'2016'!$Q$4","v":0},{"$f":"G13+F14","v":0},{"$f":"'2016'!$R$4","v":0},{"$f":"I13+H14","v":0},{"$f":"'2016'!$S$4","v":0},{"$f":"K13+J14","v":0}]
[{"$f":"'2017'!C2","v":2017},{"$f":"MIN('2017'!$C$7:$C$100)","v":"00:00:00"},{"$f":"MAX('2017'!$C$7:$C$100)","v":"00:00:00"},{"$f":"'2017'!$P$4","v":0},0,{"$f":"'2017'!$Q$4","v":0},0,{"$f":"'2017'!$R$4","v":0},0,{"$f":"'2017'!$S$4","v":0},0]
[{"$f":"'2018'!C2","v":2018},{"$f":"MIN('2018'!$C$7:$C$100)","v":"00:00:00"},{"$f":"MAX('2018'!$C$7:$C$100)","v":"00:00:00"},{"$f":"'2018'!$P$4","v":0},0,{"$f":"'2018'!$Q$4","v":0},0,{"$f":"'2018'!$R$4","v":0},0,{"$f":"'2018'!$S$4","v":0},0]
[{"$f":"'2019'!C2","v":2019},{"$f":"MIN('2019'!$C$7:$C$100)","v":"00:00:00"},{"$f":"MAX('2019'!$C$7:$C$100)","v":"00:00:00"},{"$f":"'2019'!$P$4","v":0},0,{"$f":"'2019'!$Q$4","v":0},0,{"$f":"'2019'!$R$4","v":0},0,{"$f":"'2019'!$S$4","v":0},0]
[{"$f":"'2020'!C2","v":2020},{"$f":"MIN('2020'!$C$7:$C$100)","v":"00:00:00"},{"$f":"MAX('2020'!$C$7:$C$100)","v":"00:00:00"},{"$f":"'2020'!$P$4","v":0},0,{"$f":"'2020'!$Q$4","v":0},0,{"$f":"'2020'!$R$4","v":0},0,{"$f":"'2020'!$S$4","v":0},0]
[{"$f":"'2021'!C2","v":2021},{"$f":"MIN('2021'!$C$7:$C$100)","v":"00:00:00"},{"$f":"MAX('2021'!$C$7:$C$100)","v":"00:00:00"},{"$f":"'2021'!$P$4","v":0},{"$f":"D19+E18","v":0},{"$f":"'2021'!$Q$4","v":0},{"$f":"G18+F19","v":0},{"$f":"'2021'!$R$4","v":0},{"$f":"I18+H19","v":0},{"$f":"'2021'!$S$4","v":0},{"$f":"K18+J19","v":0}]
[{"$f":"'2022'!C2","v":2022},{"$f":"MIN('2022'!$C$7:$C$100)","v":"00:00:00"},{"$f":"MAX('2022'!$C$7:$C$100)","v":"00:00:00"},{"$f":"'2022'!$P$4","v":0},0,{"$f":"'2022'!$Q$4","v":0},0,{"$f":"'2022'!$R$4","v":0},0,{"$f":"'2022'!$S$4","v":0},0]
[{"$f":"'2023'!C2","v":2023},{"$f":"MIN('2023'!$C$7:$C$100)","v":"00:00:00"},{"$f":"MAX('2023'!C15:C108)","v":"00:00:00"},{"$f":"'2023'!$P$4","v":0},0,{"$f":"'2023'!$Q$4","v":0},0,{"$f":"'2023'!$R$4","v":0},0,{"$f":"'2023'!$S$4","v":0},0]
[{"$f":"'2024'!C2","v":2024},{"$f":"MIN('2024'!$C$7:$C$100)","v":"00:00:00"},{"$f":"MAX('2024'!C15:C108)","v":"00:00:00"},{"$f":"'2024'!$P$4","v":0},0,{"$f":"'2024'!$Q$4","v":0},0,{"$f":"'2024'!$R$4","v":0},0,{"$f":"'2024'!$S$4","v":0},0]
[{"$f":"'2025'!C2","v":2025},{"$f":"MIN('2025'!$C$7:$C$100)","v":"00:00:00"},{"$f":"MAX('2025'!$C$7:$C$100)","v":"00:00:00"},{"$f":"'2025'!$P$4","v":0},0,{"$f":"'2025'!$Q$4","v":0},0,{"$f":"'2025'!$R$4","v":0},0,{"$f":"'2025'!$S$4","v":0},0]
[{"$f":"'2026'!C2","v":2026},{"$f":"MIN('2026'!$C$7:$C$110)","v":"00:00:00"},{"$f":"MAX('2026'!$C$7:$C$100)","v":"00:00:00"},{"$f":"'2026'!$P$4","v":0},0,{"$f":"'2026'!$Q$4","v":0},0,{"$f":"'2026'!$R$4","v":0},0,{"$f":"'2026'!$S$4","v":0},0]
[{"$f":"'2027'!C2","v":2027},{"$f":"MIN('2027'!$C$7:$C$100)","v":"00:00:00"},{"$f":"MAX('2027'!C7:C100)","v":"00:00:00"},{"$f":"'2027'!$P$4","v":0},0,{"$f":"'2027'!$Q$4","v":0},0,{"$f":"'2027'!$R$4","v":0},0,{"$f":"'2027'!$S$4","v":0},0]
[{"$f":"'2028'!C2","v":2028},{"$f":"MIN('2028'!$C$7:$C$110)","v":"00:00:00"},{"$f":"MAX('2028'!$C$7:$C$100)","v":"00:00:00"},{"$f":"'2028'!$P$4","v":0},{"$f":"D26+E25","v":0},{"$f":"'2028'!$Q$4","v":0},{"$f":"G25+F26","v":0},{"$f":"'2028'!$R$4","v":0},{"$f":"I25+H26","v":0},{"$f":"'2028'!$S$4","v":0},{"$f":"K25+J26","v":0}]
[{"$f":"'2029'!C2","v":2029},{"$f":"MIN('2029'!$C$7:$C$100)","v":"00:00:00"},{"$f":"MAX('2029'!C9:C102)","v":"00:00:00"},{"$f":"'2029'!$P$4","v":0},0,{"$f":"'2029'!$Q$4","v":0},0,{"$f":"'2029'!$R$4","v":0},0,{"$f":"'2029'!$S$4","v":0},0]
[{"$f":"'2030'!C2","v":2030},{"$f":"MIN('2030'!$C$7:$C$110)","v":"00:00:00"},{"$f":"MAX('2030'!$C$7:$C$100)","v":"00:00:00"},{"$f":"'2030'!$P$4","v":0},{"$f":"D28+E27","v":0},{"$f":"'2030'!$Q$4","v":0},{"$f":"G27+F28","v":0},{"$f":"'2030'!$R$4","v":0},{"$f":"I27+H28","v":0},{"$f":"'2030'!$S$4","v":0},{"$f":"K27+J28","v":0}]
[{"$f":"'2031'!C2","v":2031},{"$f":"MIN('2031'!$C$7:$C$100)","v":"00:00:00"},{"$f":"MAX('2031'!C11:C104)","v":"00:00:00"},{"$f":"'2031'!$P$4","v":0},0,{"$f":"'2031'!$Q$4","v":0},0,{"$f":"'2031'!$R$4","v":0},0,{"$f":"'2031'!$S$4","v":0},0]
[{"$f":"'2032'!C2","v":2032},{"$f":"MIN('2032'!$C$7:$C$100)","v":"00:00:00"},{"$f":"MAX('2032'!$C$7:$C$100)","v":"00:00:00"},{"$f":"'2032'!$P$4","v":0},0,{"$f":"'2032'!$Q$4","v":0},0,{"$f":"'2032'!$R$4","v":0},0,{"$f":"'2032'!$S$4","v":0},0]
[{"$f":"'2033'!$C$2","v":2033},{"$f":"MIN('2033'!$C$7:$C$100)","v":"00:00:00"},{"$f":"MAX('2033'!$C$7:$C$100)","v":"00:00:00"},{"$f":"'2033'!$P$4","v":0},0,{"$f":"'2033'!$Q$4","v":0},0,{"$f":"'2033'!$R$4","v":0},0,{"$f":"'2033'!$S$4","v":0},0]
[{"$f":"'2034'!$C$2","v":2034},{"$f":"MIN('2034'!$C$7:$C$100)","v":"00:00:00"},{"$f":"MAX('2034'!$C$7:$C$100)","v":"00:00:00"},{"$f":"'2034'!$P$4","v":0},0,{"$f":"'2034'!$Q$4","v":0},0,{"$f":"'2034'!$R$4","v":0},0,{"$f":"'2034'!$S$4","v":0},0]
[{"$f":"'2035'!$C$2","v":2035},{"$f":"MIN('2035'!$C$7:$C$100)","v":"00:00:00"},{"$f":"MAX('2035'!$C$7:$C$100)","v":"00:00:00"},{"$f":"'2035'!$P$4","v":0},0,{"$f":"'2035'!$Q$4","v":0},0,{"$f":"'2035'!$R$4","v":0},0,{"$f":"'2035'!$S$4","v":0},0]
[{"$f":"'2036'!$C$2","v":2036},{"$f":"MIN('2036'!$C$7:$C$100)","v":"00:00:00"},{"$f":"MAX('2036'!$C$7:$C$100)","v":"00:00:00"},{"$f":"'2036'!$P$4","v":0},0,{"$f":"'2036'!$Q$4","v":0},0,{"$f":"'2036'!$R$4","v":0},0,{"$f":"'2036'!$S$4","v":0},0]
[{"$f":"'2037'!$C$2","v":2037},{"$f":"MIN('2037'!$C$7:$C$100)","v":"00:00:00"},{"$f":"MAX('2037'!$C$7:$C$100)","v":"00:00:00"},{"$f":"'2037'!$P$4","v":0},0,{"$f":"'2037'!$Q$4","v":0},0,{"$f":"'2037'!$R$4","v":0},0,{"$f":"'2037'!$S$4","v":0},0]
[{"$f":"'2038'!$C$2","v":2038},{"$f":"MIN('2038'!$C$7:$C$100)","v":"00:00:00"},{"$f":"MAX('2038'!$C$7:$C$100)","v":"00:00:00"},{"$f":"'2038'!$P$4","v":0},0,{"$f":"'2038'!$Q$4","v":0},0,{"$f":"'2038'!$R$4","v":0},0,{"$f":"'2038'!$S$4","v":0},0]
[{"$f":"'2039'!C2","v":2039},{"$f":"MIN('2039'!$C$7:$C$100)","v":"00:00:00"},{"$f":"MAX('2039'!$C$7:$C$100)","v":"00:00:00"},{"$f":"'2039'!$P$4","v":0},0,{"$f":"'2039'!$Q$4","v":0},0,{"$f":"'2039'!$R$4","v":0},0,{"$f":"'2039'!$S$4","v":0},0]
[{"$f":"'2040'!C2","v":2040},{"$f":"MIN('2040'!$C$7:$C$100)","v":"00:00:00"},{"$f":"MAX('2040'!$C$7:$C$100)","v":"00:00:00"},{"$f":"'2040'!$P$4","v":0},0,{"$f":"'2040'!$Q$4","v":0},0,{"$f":"'2040'!$R$4","v":0},0,{"$f":"'2040'!$S$4","v":0},0]
[{"$f":"'2041'!C2","v":2041},{"$f":"MIN('2041'!$C$7:$C$100)","v":"00:00:00"},{"$f":"MAX('2041'!$C$7:$C$100)","v":"00:00:00"},{"$f":"'2041'!$P$4","v":0},0,{"$f":"'2041'!$Q$4","v":0},0,{"$f":"'2041'!$R$4","v":0},0,{"$f":"'2041'!$S$4","v":0},0]
[]
[]
["Summe",{"$nulls":3},{"$f":"E39","v":0},null,{"$f":"G39","v":0},null,{"$f":"I39","v":0},null,{"$f":"K39","v":0}]
[{"$nulls":10},{"$f":"K42*24","v":0}]

{"sheet":"Jahresabschluss","index":34,"n_rows":28,"n_cols":10,"rows_kept":28,"merged":[[5,3,5,6],[6,3,6,6],[7,3,7,6],[8,3,8,6],[9,3,9,6],[21,3,21,6],[22,3,22,6],[23,3,23,6],[24,3,24,6]]}
[]
[]
[{"$nulls":9},"Zeilen-Index für Jahresabschluss in der Tabelle \"total\""]
[]
[null,null,"                Jahresabschluss",null,{"$f":"INDIRECT(\"total!A\"&$J5)","v":2020},{"$nulls":4},18]
[null,null,{"$f":"Beginn!$A$22","v":"Name"},{"$f":"Beginn!$E$22","v":"<Name>"}]
[null,null,{"$f":"Beginn!$A$23","v":"Vorname"},{"$f":"Beginn!$E$23","v":"<Vorname>"}]
[null,null,{"$f":"Beginn!$A$24","v":"ET-Nummer"},{"$f":"Beginn!$E$24","v":"14/613/XXX/JJJJ"}]
[null,null,{"$f":"Beginn!$A$25","v":"Geb.Datum"},{"$f":"Beginn!$E$25","v":"1990-01-01"}]
[null,null,{"$f":"Beginn!$A$26","v":"G31 gültig bis"},{"$f":"Beginn!$E$26","v":"1990-12-31"}]
[{"$nulls":4},"Tauchstunden"]
[null,null,"Gesamttauchzeit",{"$f":"E5","v":2020},{"$f":"INDIRECT(\"total!F\"&$J5)","v":0},null,"hh:mm"]
[null,null,"davon GUV-R2101",{"$f":"E5","v":2020},{"$f":"INDIRECT(\"total!J\"&$J5)","v":0},null,"hh:mm"]
[null,null,"Gesamttauchstunden",null,{"$f":"INDIRECT(\"total!G\"&$J5)","v":0},null,"hh:mm"]
[null,null,"davon Gesamtstunden GUV",null,{"$f":"INDIRECT(\"total!K\"&$J5)","v":0},null,"hh:mm"]
[{"$nulls":4},"Tauchgänge"]
[null,null,"Gesamt",{"$f":"E5","v":2020},{"$f":"INDIRECT(\"total!D\"&$J5)","v":0}]
[null,null,"davon GUV-R2101",{"$f":"E5","v":2020},{"$f":"INDIRECT(\"total!H\"&$J5)","v":0}]
[null,null,"Gesamtzahl Tauchgänge",null,{"$f":"INDIRECT(\"total!E\"&$J5)","v":0}]
[null,null,"davon Gesamtzahl GUV",null,{"$f":"INDIRECT(\"total!I\"&$J5)","v":0}]
[]
[null,null,{"$f":"Beginn!$A$27","v":"Erfahrener Taucher seit"},{"$f":"Beginn!$E$27","v":"Keine"}]
[null,null,{"$f":"Beginn!$A$28","v":"Nitrox Genehmigung seit"},{"$f":"Beginn!$E$28","v":"Keine"}]
[null,null,{"$f":"Beginn!$A$29","v":"Berechtigung 30 m gültig bis"},{"$f":"Beginn!$E$29","v":"keine"}]
[null,null,{"$f":"Beginn!$A$30","v":"Bestätigt TL / Bez. Tauchwart"},{"$f":"Beginn!$E$30","v":"<Name>"}]
[]
[]
[null,null,{"$f":"E5","v":2020}]

{"sheet":"Diagramme","index":35,"n_rows":0,"n_cols":0,"rows_kept":0}

{"sheet":"ET2&TaEF","index":36,"n_rows":1000,"n_cols":18,"rows_kept":1000,"merged":[[0,14,0,15],[8,0,8,1],[8,15,8,16]]}
[{"$nulls":14},"Erreichte GT\nAnzahl                  -Stunden"]
[null,"Name",{"$f":"Beginn!E22","v":"<Name>"},{"$nulls":9},"GT-Stunden",1.5416666666666667,{"$f":"total!E42-total!I42","v":0},{"$f":"total!G42-total!K42","v":0}]
[null,"Vorname",{"$f":"Beginn!E23","v":"<Vorname>"},{"$nulls":9},"GUV-Stunden",0.7291666666666666]
[null,"Geb",{"$f":"Beginn!E25","v":"1990-01-01"},{"$nulls":9},"TaEF Anzahl",50]
[]
[]
[]
[]
["Tauchgang",null,"Datum","Einstieg","Ausstieg","Tiefe","Art","Bemerkung","Zeit",{"$nulls":3},"GUV","GT kum","GUV kum","Bemerkung GT/ GUV ok",null,"TaEF OK"]
[{"$nulls":12},{"$f":"IF(G10=\"GUV\",I10,0)","v":0},{"$f":"IF(G10>0,I10,0)","v":0},{"$f":"IF(G10=\"GUV\",I10,0)","v":0},{"$f":"IF(N10>=$N$2,\"TG OK\",\"TG zu Wenig\")","v":"TG zu Wenig"},{"$f":"IF(O10>=$N$3,\"GUV OK\",\"GUV zu Wenig\")","v":"GUV zu Wenig"},{"$f":"IF(G10=\"GUV\",1,0)","v":0}]
[{"$nulls":12},{"$f":"IF(G11=\"GUV\",I11,0)","v":0},{"$f":"IF(G11>0,I11+N10,N10)","v":0},{"$f":"IF(G11=\"GUV\",M11+O10,O10)","v":0},{"$f":"IF(N11>=$N$2,\"TG OK\",\"TG zu Wenig\")","v":"TG zu Wenig"},{"$f":"IF(O11>=$N$3,\"GUV OK\",\"GUV zu Wenig\")","v":"GUV zu Wenig"},{"$f":"IF(G11=\"GUV\",1+R10,R10)","v":0}]
[{"$nulls":12},0,{"$f":"IF(G12>0,I12+N11,N11)","v":0},{"$f":"IF(G12=\"GUV\",M12+O11,O11)","v":0},"TG zu Wenig","GUV zu Wenig",{"$f":"IF(G12=\"GUV\",1+R11,R11)","v":0}]
[{"$nulls":12},0,0,0,"TG zu Wenig","GUV zu Wenig",0]
[{"$nulls":12},0,0,0,"TG zu Wenig","GUV zu Wenig",0]
[{"$nulls":12},0,0,0,"TG zu Wenig","GUV zu Wenig",0]
[{"$nulls":12},0,0,0,"TG zu Wenig","GUV zu Wenig",0]
[{"$nulls":12},0,0,0,"TG zu Wenig","GUV zu Wenig",0]
[{"$nulls":12},0,0,0,"TG zu Wenig","GUV zu Wenig",0]
[{"$nulls":12},0,0,0,"TG zu Wenig","GUV zu Wenig",0]
[{"$nulls":12},0,0,0,"TG zu Wenig","GUV zu Wenig",0]
[{"$nulls":12},0,0,0,"TG zu Wenig","GUV zu Wenig",0]
[{"$nulls":12},0,0,0,"TG zu Wenig","GUV zu Wenig",0]
[{"$nulls":12},0,0,0,"TG zu Wenig","GUV zu Wenig",0]
[{"$nulls":12},0,0,0,"TG zu Wenig","GUV zu Wenig",0]
[{"$nulls":12},0,0,0,"TG zu Wenig","GUV zu Wenig",0]
[{"$nulls":12},0,0,0,"TG zu Wenig","GUV zu Wenig",0]
[{"$nulls":12},0,0,0,"TG zu Wenig","GUV zu Wenig",0]
[{"$nulls":12},0,0,0,"TG zu Wenig","GUV zu Wenig",0]
[{"$nulls":12},0,0,0,"TG zu Wenig","GUV zu Wenig",0]
[{"$nulls":12},0,0,0,"TG zu Wenig","GUV zu Wenig",0]
[{"$nulls":12},0,0,0,"TG zu Wenig","GUV zu Wenig",0]
[{"$nulls":12},0,0,0,"TG zu Wenig","GUV zu Wenig",0]
[{"$nulls":12},0,0,0,"TG zu Wenig","GUV zu Wenig",0]
[{"$nulls":12},0,0,0,"TG zu Wenig","GUV zu Wenig",0]
[{"$nulls":12},0,0,0,"TG zu Wenig","GUV zu Wenig",0]
[{"$nulls":12},0,0,0,"TG zu Wenig","GUV zu Wenig",0]
[{"$nulls":12},0,0,0,"TG zu Wenig","GUV zu Wenig",0]
[{"$nulls":12},0,0,0,"TG zu Wenig","GUV zu Wenig",0]
[{"$nulls":12},0,0,0,"TG zu Wenig","GUV zu Wenig",0]
[{"$nulls":12},0,0,0,"TG zu Wenig","GUV zu Wenig",0]
[{"$nulls":12},0,0,0,"TG zu Wenig","GUV zu Wenig",0]
[{"$nulls":12},0,0,0,"TG zu Wenig","GUV zu Wenig",0]
[{"$nulls":12},0,0,0,"TG zu Wenig","GUV zu Wenig",0]
[{"$nulls":12},0,0,0,"TG zu Wenig","GUV zu Wenig",0]
[{"$nulls":12},0,0,0,"TG zu Wenig","GUV zu Wenig",0]
[{"$nulls":12},0,0,0,"TG zu Wenig","GUV zu Wenig",0]
[{"$nulls":12},0,0,0,"TG zu Wenig","GUV zu Wenig",0]
[{"$nulls":12},0,0,0,"TG zu Wenig","GUV zu Wenig",0]
[{"$nulls":12},0,0,0,"TG zu Wenig","GUV zu Wenig",0]
[{"$nulls":12},0,0,0,"TG zu Wenig","GUV zu Wenig",0]
[{"$nulls":12},0,0,{"$f":"IF(G51=\"GUV\",M51+O50,O50)","v":0},"TG zu Wenig","GUV zu Wenig",0]
[{"$nulls":12},0,0,0,"TG zu Wenig","GUV zu Wenig",0]
[{"$nulls":12},0,0,0,"TG zu Wenig","GUV zu Wenig",0]
[{"$nulls":12},0,0,0,"TG zu Wenig","GUV zu Wenig",0]
[{"$nulls":12},0,0,0,"TG zu Wenig","GUV zu Wenig",0]
[{"$nulls":12},0,0,0,"TG zu Wenig","GUV zu Wenig",0]
[{"$nulls":12},0,0,0,"TG zu Wenig","GUV zu Wenig",0]
[{"$nulls":12},0,0,0,"TG zu Wenig","GUV zu Wenig",0]
[{"$nulls":12},0,0,0,"TG zu Wenig","GUV zu Wenig",0]
[{"$nulls":12},0,0,0,"TG zu Wenig","GUV zu Wenig",0]
[{"$nulls":12},0,0,0,"TG zu Wenig","GUV zu Wenig",0]
[{"$nulls":12},0,0,0,"TG zu Wenig","GUV zu Wenig",0]
[{"$nulls":12},0,0,0,"TG zu Wenig","GUV zu Wenig",0]
[{"$nulls":12},0,0,0,{"$f":"IF(N64>=$N$2,\"TG OK\",\"TG zu Wenig\")","v":"TG zu Wenig"},{"$f":"IF(O64>=$N$3,\"GUV OK\",\"GUV zu Wenig\")","v":"GUV zu Wenig"},0]
[{"$nulls":12},0,0,0,{"$f":"IF(N65>=$N$2,\"TG OK\",\"TG zu Wenig\")","v":"TG zu Wenig"},{"$f":"IF(O65>=$N$3,\"GUV OK\",\"GUV zu Wenig\")","v":"GUV zu Wenig"},0]
[{"$nulls":12},0,0,0,{"$f":"IF(N66>=$N$2,\"TG OK\",\"TG zu Wenig\")","v":"TG zu Wenig"},{"$f":"IF(O66>=$N$3,\"GUV OK\",\"GUV zu Wenig\")","v":"GUV zu Wenig"},0]
[{"$nulls":12},0,0,0,{"$f":"IF(N67>=$N$2,\"TG OK\",\"TG zu Wenig\")","v":"TG zu Wenig"},{"$f":"IF(O67>=$N$3,\"GUV OK\",\"GUV zu Wenig\")","v":"GUV zu Wenig"},0]
[{"$nulls":12},0,0,0,{"$f":"IF(N68>=$N$2,\"TG OK\",\"TG zu Wenig\")","v":"TG zu Wenig"},{"$f":"IF(O68>=$N$3,\"GUV OK\",\"GUV zu Wenig\")","v":"GUV zu Wenig"},0]
[{"$nulls":12},0,0,0,"TG zu Wenig","GUV zu Wenig",0]
[{"$nulls":12},0,0,0,"TG zu Wenig","GUV zu Wenig",0]
[{"$nulls":12},0,0,0,"TG zu Wenig","GUV zu Wenig",0]
[{"$nulls":12},0,0,0,"TG zu Wenig","GUV zu Wenig",0]
[{"$nulls":12},0,0,0,"TG zu Wenig","GUV zu Wenig",0]
[{"$nulls":12},0,0,0,"TG zu Wenig","GUV zu Wenig",0]
[{"$nulls":12},{"$f":"IF(G75=\"GUV\",I75,0)","v":0},0,0,"TG zu Wenig","GUV zu Wenig",0]
[{"$nulls":12},0,{"$f":"IF(G76>0,I76+N75,N75)","v":0},0,{"$f":"IF(N76>=$N$2,\"TG OK\",\"TG zu Wenig\")","v":"TG zu Wenig"},{"$f":"IF(O76>=$N$3,\"GUV OK\",\"GUV zu Wenig\")","v":"GUV zu Wenig"},{"$f":"IF(G76=\"GUV\",1+R75,R75)","v":0}]
[{"$nulls":12},0,0,0,{"$f":"IF(N77>=$N$2,\"TG OK\",\"TG zu Wenig\")","v":"TG zu Wenig"},{"$f":"IF(O77>=$N$3,\"GUV OK\",\"GUV zu Wenig\")","v":"GUV zu Wenig"},0]
[{"$nulls":12},0,0,0,{"$f":"IF(N78>=$N$2,\"TG OK\",\"TG zu Wenig\")","v":"TG zu Wenig"},{"$f":"IF(O78>=$N$3,\"GUV OK\",\"GUV zu Wenig\")","v":"GUV zu Wenig"},0]
[{"$nulls":12},0,0,0,"TG zu Wenig","GUV zu Wenig",0]
[{"$nulls":12},0,0,0,"TG zu Wenig","GUV zu Wenig",0]
[{"$nulls":12},0,0,0,"TG zu Wenig","GUV zu Wenig",0]
[{"$nulls":12},0,0,0,"TG zu Wenig","GUV zu Wenig",0]
[{"$nulls":12},0,0,0,"TG zu Wenig","GUV zu Wenig",0]
[{"$nulls":12},0,0,0,"TG zu Wenig","GUV zu Wenig",0]
[{"$nulls":12},0,0,0,"TG zu Wenig","GUV zu Wenig",0]
[{"$nulls":12},0,0,0,"TG zu Wenig","GUV zu Wenig",0]
[{"$nulls":12},0,0,0,"TG zu Wenig","GUV zu Wenig",0]
[{"$nulls":12},0,0,0,"TG zu Wenig","GUV zu Wenig",0]
[{"$nulls":12},0,0,0,"TG zu Wenig","GUV zu Wenig",0]
[{"$nulls":12},0,0,0,"TG zu Wenig","GUV zu Wenig",0]
[{"$nulls":12},0,0,0,"TG zu Wenig","GUV zu Wenig",0]
[{"$nulls":12},0,0,0,"TG zu Wenig","GUV zu Wenig",0]
[{"$nulls":12},0,0,0,"TG zu Wenig","GUV zu Wenig",0]
[{"$nulls":12},0,0,0,"TG zu Wenig","GUV zu Wenig",0]
[{"$nulls":12},0,0,0,"TG zu Wenig","GUV zu Wenig",0]
[{"$nulls":12},0,0,0,"TG zu Wenig","GUV zu Wenig",0]
[{"$nulls":12},0,0,0,"TG zu Wenig","GUV zu Wenig",0]
[{"$nulls":12},0,0,0,"TG zu Wenig","GUV zu Wenig",0]
[{"$nulls":12},0,0,0,"TG zu Wenig","GUV zu Wenig",0]
[{"$nulls":12},0,0,0,"TG zu Wenig","GUV zu Wenig",0]
[{"$nulls":12},0,0,0,"TG zu Wenig","GUV zu Wenig",0]
[{"$nulls":12},0,0,0,"TG zu Wenig","GUV zu Wenig",0]
[{"$nulls":12},0,0,0,"TG zu Wenig","GUV zu Wenig",0]
[{"$nulls":12},0,0,0,"TG zu Wenig","GUV zu Wenig",0]
[{"$nulls":12},0,0,0,"TG zu Wenig","GUV zu Wenig",0]
[{"$nulls":12},0,0,0,"TG zu Wenig","GUV zu Wenig",0]
[{"$nulls":12},0,0,0,"TG zu Wenig","GUV zu Wenig",0]
[{"$nulls":12},0,0,0,"TG zu Wenig","GUV zu Wenig",0]
[{"$nulls":12},0,0,0,"TG zu Wenig","GUV zu Wenig",0]
[{"$nulls":12},0,0,0,"TG zu Wenig","GUV zu Wenig",0]
[{"$nulls":12},0,0,0,"TG zu Wenig","GUV zu Wenig",0]
[{"$nulls":12},0,0,0,"TG zu Wenig","GUV zu Wenig",0]
[{"$nulls":12},0,0,0,"TG zu Wenig","GUV zu Wenig",0]
[{"$nulls":12},0,0,0,"TG zu Wenig","GUV zu Wenig",0]
[{"$nulls":12},0,0,{"$f":"IF(G115=\"GUV\",M115+O114,O114)","v":0},"TG zu Wenig","GUV zu Wenig",0]
[{"$nulls":12},0,0,0,"TG zu Wenig","GUV zu Wenig",0]
[{"$nulls":12},0,0,0,"TG zu Wenig","GUV zu Wenig",0]
[{"$nulls":12},0,0,0,"TG zu Wenig","GUV zu Wenig",0]
[{"$nulls":12},0,0,0,"TG zu Wenig","GUV zu Wenig",0]
[{"$nulls":12},0,0,0,"TG zu Wenig","GUV zu Wenig",0]
[{"$nulls":12},0,0,0,"TG zu Wenig","GUV zu Wenig",0]
[{"$nulls":12},0,0,0,"TG zu Wenig","GUV zu Wenig",0]
[{"$nulls":12},0,0,0,"TG zu Wenig","GUV zu Wenig",0]
[{"$nulls":12},0,0,0,"TG zu Wenig","GUV zu Wenig",0]
[{"$nulls":12},0,0,0,"TG zu Wenig","GUV zu Wenig",0]
[{"$nulls":12},0,0,0,"TG zu Wenig","GUV zu Wenig",0]
[{"$nulls":12},0,0,0,"TG zu Wenig","GUV zu Wenig",0]
[{"$nulls":12},0,0,0,"TG zu Wenig","GUV zu Wenig",0]
[{"$nulls":12},0,0,0,"TG zu Wenig","GUV zu Wenig",0]
[{"$nulls":12},0,0,0,"TG zu Wenig","GUV zu Wenig",0]
[{"$nulls":12},0,0,0,"TG zu Wenig","GUV zu Wenig",0]
[{"$nulls":12},0,0,0,"TG zu Wenig","GUV zu Wenig",0]
[{"$nulls":12},0,0,0,"TG zu Wenig","GUV zu Wenig",0]
[{"$nulls":12},0,0,0,"TG zu Wenig","GUV zu Wenig",0]
[{"$nulls":12},0,0,0,"TG zu Wenig","GUV zu Wenig",0]
[{"$nulls":12},0,0,0,"TG zu Wenig","GUV zu Wenig",0]
[{"$nulls":12},0,0,0,"TG zu Wenig","GUV zu Wenig",0]
[{"$nulls":12},0,0,0,"TG zu Wenig","GUV zu Wenig",0]
[{"$nulls":12},{"$f":"IF(G139=\"GUV\",I139,0)","v":0},0,0,"TG zu Wenig","GUV zu Wenig",0]
[{"$nulls":12},0,{"$f":"IF(G140>0,I140+N139,N139)","v":0},0,"TG zu Wenig","GUV zu Wenig",{"$f":"IF(G140=\"GUV\",1+R139,R139)","v":0}]
[{"$nulls":12},0,0,0,"TG zu Wenig","GUV zu Wenig",0]
[{"$nulls":12},0,0,0,{"$f":"IF(N142>=$N$2,\"TG OK\",\"TG zu Wenig\")","v":"TG zu Wenig"},{"$f":"IF(O142>=$N$3,\"GUV OK\",\"GUV zu Wenig\")","v":"GUV zu Wenig"},0]
[{"$nulls":12},0,0,0,"TG zu Wenig","GUV zu Wenig",0]
[{"$nulls":12},0,0,0,"TG zu Wenig","GUV zu Wenig",0]
[{"$nulls":12},0,0,0,"TG zu Wenig","GUV zu Wenig",0]
[{"$nulls":12},0,0,0,"TG zu Wenig","GUV zu Wenig",0]
[{"$nulls":12},0,0,0,"TG zu Wenig","GUV zu Wenig",0]
[{"$nulls":12},0,0,0,"TG zu Wenig","GUV zu Wenig",0]
[{"$nulls":12},0,0,0,"TG zu Wenig","GUV zu Wenig",0]
[{"$nulls":12},0,0,0,"TG zu Wenig","GUV zu Wenig",0]
[{"$nulls":12},0,0,0,"TG zu Wenig","GUV zu Wenig",0]
[{"$nulls":12},0,0,0,"TG zu Wenig","GUV zu Wenig",0]
[{"$nulls":12},0,0,0,"TG zu Wenig","GUV zu Wenig",0]
[{"$nulls":12},0,0,0,"TG zu Wenig","GUV zu Wenig",0]
[{"$nulls":12},0,0,0,"TG zu Wenig","GUV zu Wenig",0]
[{"$nulls":12},0,0,0,"TG zu Wenig","GUV zu Wenig",0]
[{"$nulls":12},0,0,0,"TG zu Wenig","GUV zu Wenig",0]
[{"$nulls":12},0,0,0,"TG zu Wenig","GUV zu Wenig",0]
[{"$nulls":12},0,0,0,"TG zu Wenig","GUV zu Wenig",0]
[{"$nulls":12},0,0,0,"TG zu Wenig","GUV zu Wenig",0]
[{"$nulls":12},0,0,0,"TG zu Wenig","GUV zu Wenig",0]
[{"$nulls":12},0,0,0,"TG zu Wenig","GUV zu Wenig",0]
[{"$nulls":12},0,0,0,"TG zu Wenig","GUV zu Wenig",0]
[{"$nulls":12},0,0,0,"TG zu Wenig","GUV zu Wenig",0]
[{"$nulls":12},0,0,0,"TG zu Wenig","GUV zu Wenig",0]
[{"$nulls":12},0,0,0,"TG zu Wenig","GUV zu Wenig",0]
[{"$nulls":12},0,0,0,"TG zu Wenig","GUV zu Wenig",0]
[{"$nulls":12},0,0,0,"TG zu Wenig","GUV zu Wenig",0]
[{"$nulls":12},0,0,0,"TG zu Wenig","GUV zu Wenig",0]
[{"$nulls":12},0,0,0,"TG zu Wenig","GUV zu Wenig",0]
[{"$nulls":12},0,0,0,"TG zu Wenig","GUV zu Wenig",0]
[{"$nulls":12},0,0,0,"TG zu Wenig","GUV zu Wenig",0]
[{"$nulls":12},0,0,0,"TG zu Wenig","GUV zu Wenig",0]
[{"$nulls":12},0,0,0,"TG zu Wenig","GUV zu Wenig",0]
[{"$nulls":12},0,0,0,"TG zu Wenig","GUV zu Wenig",0]
[{"$nulls":12},0,0,0,"TG zu Wenig","GUV zu Wenig",0]
[{"$nulls":12},0,0,0,"TG zu Wenig","GUV zu Wenig",0]
[{"$nulls":12},0,0,0,"TG zu Wenig","GUV zu Wenig",0]
[{"$nulls":12},0,0,{"$f":"IF(G179=\"GUV\",M179+O178,O178)","v":0},"TG zu Wenig","GUV zu Wenig",0]
[{"$nulls":12},0,0,0,"TG zu Wenig","GUV zu Wenig",0]
[{"$nulls":12},0,0,0,"TG zu Wenig","GUV zu Wenig",0]
[{"$nulls":12},0,0,0,"TG zu Wenig","GUV zu Wenig",0]
[{"$nulls":12},0,0,0,"TG zu Wenig","GUV zu Wenig",0]
[{"$nulls":12},0,0,0,"TG zu Wenig","GUV zu Wenig",0]
[{"$nulls":12},0,0,0,"TG zu Wenig","GUV zu Wenig",0]
[{"$nulls":12},0,0,0,"TG zu Wenig","GUV zu Wenig",0]
[{"$nulls":12},0,0,0,"TG zu Wenig","GUV zu Wenig",0]
[{"$nulls":12},0,0,0,"TG zu Wenig","GUV zu Wenig",0]
[{"$nulls":12},0,0,0,"TG zu Wenig","GUV zu Wenig",0]
[{"$nulls":12},0,0,0,"TG zu Wenig","GUV zu Wenig",0]
[{"$nulls":12},0,0,0,"TG zu Wenig","GUV zu Wenig",0]
[{"$nulls":12},0,0,0,"TG zu Wenig","GUV zu Wenig",0]
[{"$nulls":12},0,0,0,"TG zu Wenig","GUV zu Wenig",0]
[{"$nulls":12},0,0,0,"TG zu Wenig","GUV zu Wenig",0]
[{"$nulls":12},0,0,0,"TG zu Wenig","GUV zu Wenig",0]
[{"$nulls":12},0,0,0,"TG zu Wenig","GUV zu Wenig",0]
[{"$nulls":12},0,0,0,"TG zu Wenig","GUV zu Wenig",0]
[{"$nulls":12},0,0,0,"TG zu Wenig","GUV zu Wenig",0]
[{"$nulls":12},0,0,0,"TG zu Wenig","GUV zu Wenig",0]
[{"$nulls":12},0,0,0,"TG zu Wenig","GUV zu Wenig",0]
[{"$nulls":12},0,0,0,"TG zu Wenig","GUV zu Wenig",0]
[{"$nulls":12},0,0,0,"TG zu Wenig","GUV zu Wenig",0]
[{"$nulls":12},{"$f":"IF(G203=\"GUV\",I203,0)","v":0},0,0,"TG zu Wenig","GUV zu Wenig",0]
[{"$nulls":12},0,{"$f":"IF(G204>0,I204+N203,N203)","v":0},0,"TG zu Wenig","GUV zu Wenig",{"$f":"IF(G204=\"GUV\",1+R203,R203)","v":0}]
[{"$nulls":12},0,0,0,"TG zu Wenig","GUV zu Wenig",0]
[{"$nulls":12},0,0,0,{"$f":"IF(N206>=$N$2,\"TG OK\",\"TG zu Wenig\")","v":"TG zu Wenig"},{"$f":"IF(O206>=$N$3,\"GUV OK\",\"GUV zu Wenig\")","v":"GUV zu Wenig"},0]
[{"$nulls":12},0,0,0,"TG zu Wenig","GUV zu Wenig",0]
[{"$nulls":12},0,0,0,"TG zu Wenig","GUV zu Wenig",0]
[{"$nulls":12},0,0,0,"TG zu Wenig","GUV zu Wenig",0]
[{"$nulls":12},0,0,0,"TG zu Wenig","GUV zu Wenig",0]
[{"$nulls":12},0,0,0,"TG zu Wenig","GUV zu Wenig",0]
[{"$nulls":12},0,0,0,"TG zu Wenig","GUV zu Wenig",0]
[{"$nulls":12},0,0,0,"TG zu Wenig","GUV zu Wenig",0]
[{"$nulls":12},0,0,0,"TG zu Wenig","GUV zu Wenig",0]
[{"$nulls":12},0,0,0,"TG zu Wenig","GUV zu Wenig",0]
[{"$nulls":12},0,0,0,"TG zu Wenig","GUV zu Wenig",0]
[{"$nulls":12},0,0,0,"TG zu Wenig","GUV zu Wenig",0]
[{"$nulls":12},0,0,0,"TG zu Wenig","GUV zu Wenig",0]
[{"$nulls":12},0,0,0,"TG zu Wenig","GUV zu Wenig",0]
[{"$nulls":12},0,0,0,"TG zu Wenig","GUV zu Wenig",0]
[{"$nulls":12},0,0,0,"TG zu Wenig","GUV zu Wenig",0]
[{"$nulls":12},0,0,0,"TG zu Wenig","GUV zu Wenig",0]
[{"$nulls":12},0,0,0,"TG zu Wenig","GUV zu Wenig",0]
[{"$nulls":12},0,0,0,"TG zu Wenig","GUV zu Wenig",0]
[{"$nulls":12},0,0,0,"TG zu Wenig","GUV zu Wenig",0]
[{"$nulls":12},0,0,0,"TG zu Wenig","GUV zu Wenig",0]
[{"$nulls":12},0,0,0,"TG zu Wenig","GUV zu Wenig",0]
[{"$nulls":12},0,0,0,"TG zu Wenig","GUV zu Wenig",0]
[{"$nulls":12},0,0,0,"TG zu Wenig","GUV zu Wenig",0]
[{"$nulls":12},0,0,0,"TG zu Wenig","GUV zu Wenig",0]
[{"$nulls":12},0,0,0,"TG zu Wenig","GUV zu Wenig",0]
[{"$nulls":12},0,0,0,"TG zu Wenig","GUV zu Wenig",0]
[{"$nulls":12},0,0,0,"TG zu Wenig","GUV zu Wenig",0]
[{"$nulls":12},0,0,0,"TG zu Wenig","GUV zu Wenig",0]
[{"$nulls":12},0,0,0,"TG zu Wenig","GUV zu Wenig",0]
[{"$nulls":12},0,0,0,"TG zu Wenig","GUV zu Wenig",0]
[{"$nulls":12},0,0,0,"TG zu Wenig","GUV zu Wenig",0]
[{"$nulls":12},0,0,0,"TG zu Wenig","GUV zu Wenig",0]
[{"$nulls":12},0,0,0,"TG zu Wenig","GUV zu Wenig",0]
[{"$nulls":12},0,0,0,"TG zu Wenig","GUV zu Wenig",0]
[{"$nulls":12},0,0,0,"TG zu Wenig","GUV zu Wenig",0]
[{"$nulls":12},0,0,0,"TG zu Wenig","GUV zu Wenig",0]
[{"$nulls":12},0,0,{"$f":"IF(G243=\"GUV\",M243+O242,O242)","v":0},"TG zu Wenig","GUV zu Wenig",0]
[{"$nulls":12},0,0,0,"TG zu Wenig","GUV zu Wenig",0]
[{"$nulls":12},0,0,0,"TG zu Wenig","GUV zu Wenig",0]
[{"$nulls":12},0,0,0,"TG zu Wenig","GUV zu Wenig",0]
[{"$nulls":12},0,0,0,"TG zu Wenig","GUV zu Wenig",0]
[{"$nulls":12},0,0,0,"TG zu Wenig","GUV zu Wenig",0]
[{"$nulls":12},0,0,0,"TG zu Wenig","GUV zu Wenig",0]
[{"$nulls":12},0,0,0,"TG zu Wenig","GUV zu Wenig",0]
[{"$nulls":12},0,0,0,"TG zu Wenig","GUV zu Wenig",0]
[{"$nulls":12},0,0,0,"TG zu Wenig","GUV zu Wenig",0]
[{"$nulls":12},0,0,0,"TG zu Wenig","GUV zu Wenig",0]
[{"$nulls":12},0,0,0,"TG zu Wenig","GUV zu Wenig",0]
[{"$nulls":12},0,0,0,"TG zu Wenig","GUV zu Wenig",0]
[{"$nulls":12},0,0,0,"TG zu Wenig","GUV zu Wenig",0]
[{"$nulls":12},0,0,0,"TG zu Wenig","GUV zu Wenig",0]
[{"$nulls":12},0,0,0,"TG zu Wenig","GUV zu Wenig",0]
[{"$nulls":12},0,0,0,"TG zu Wenig","GUV zu Wenig",0]
[{"$nulls":12},0,0,0,"TG zu Wenig","GUV zu Wenig",0]
[{"$nulls":12},0,0,0,"TG zu Wenig","GUV zu Wenig",0]
[{"$nulls":12},0,0,0,"TG zu Wenig","GUV zu Wenig",0]
[{"$nulls":12},0,0,0,"TG zu Wenig","GUV zu Wenig",0]
[{"$nulls":12},0,0,0,"TG zu Wenig","GUV zu Wenig",0]
[{"$nulls":12},0,0,0,"TG zu Wenig","GUV zu Wenig",0]
[{"$nulls":12},0,0,0,"TG zu Wenig","GUV zu Wenig",0]
[{"$nulls":12},{"$f":"IF(G267=\"GUV\",I267,0)","v":0},0,0,"TG zu Wenig","GUV zu Wenig",0]
[{"$nulls":12},0,{"$f":"IF(G268>0,I268+N267,N267)","v":0},0,"TG zu Wenig","GUV zu Wenig",{"$f":"IF(G268=\"GUV\",1+R267,R267)","v":0}]
[{"$nulls":12},0,0,0,"TG zu Wenig","GUV zu Wenig",0]
[{"$nulls":12},0,0,0,{"$f":"IF(N270>=$N$2,\"TG OK\",\"TG zu Wenig\")","v":"TG zu Wenig"},{"$f":"IF(O270>=$N$3,\"GUV OK\",\"GUV zu Wenig\")","v":"GUV zu Wenig"},0]
[{"$nulls":12},0,0,0,"TG zu Wenig","GUV zu Wenig",0]
[{"$nulls":12},0,0,0,"TG zu Wenig","GUV zu Wenig",0]
[{"$nulls":12},0,0,0,"TG zu Wenig","GUV zu Wenig",0]
[{"$nulls":12},0,0,0,"TG zu Wenig","GUV zu Wenig",0]
[{"$nulls":12},0,0,0,"TG zu Wenig","GUV zu Wenig",0]
[{"$nulls":12},0,0,0,"TG zu Wenig","GUV zu Wenig",0]
[{"$nulls":12},0,0,0,"TG zu Wenig","GUV zu Wenig",0]
[{"$nulls":12},0,0,0,"TG zu Wenig","GUV zu Wenig",0]
[{"$nulls":12},0,0,0,"TG zu Wenig","GUV zu Wenig",0]
[{"$nulls":12},0,0,0,"TG zu Wenig","GUV zu Wenig",0]
[{"$nulls":12},0,0,0,"TG zu Wenig","GUV zu Wenig",0]
[{"$nulls":12},0,0,0,"TG zu Wenig","GUV zu Wenig",0]
[{"$nulls":12},0,0,0,"TG zu Wenig","GUV zu Wenig",0]
[{"$nulls":12},0,0,0,"TG zu Wenig","GUV zu Wenig",0]
[{"$nulls":12},0,0,0,"TG zu Wenig","GUV zu Wenig",0]
[{"$nulls":12},0,0,0,"TG zu Wenig","GUV zu Wenig",0]
[{"$nulls":12},0,0,0,"TG zu Wenig","GUV zu Wenig",0]
[{"$nulls":12},0,0,0,"TG zu Wenig","GUV zu Wenig",0]
[{"$nulls":12},0,0,0,"TG zu Wenig","GUV zu Wenig",0]
[{"$nulls":12},0,0,0,"TG zu Wenig","GUV zu Wenig",0]
[{"$nulls":12},0,0,0,"TG zu Wenig","GUV zu Wenig",0]
[{"$nulls":12},0,0,0,"TG zu Wenig","GUV zu Wenig",0]
[{"$nulls":12},0,0,0,"TG zu Wenig","GUV zu Wenig",0]
[{"$nulls":12},0,0,0,"TG zu Wenig","GUV zu Wenig",0]
[{"$nulls":12},0,0,0,"TG zu Wenig","GUV zu Wenig",0]
[{"$nulls":12},0,0,0,"TG zu Wenig","GUV zu Wenig",0]
[{"$nulls":12},0,0,0,"TG zu Wenig","GUV zu Wenig",0]
[{"$nulls":12},0,0,0,"TG zu Wenig","GUV zu Wenig",0]
[{"$nulls":12},0,0,0,"TG zu Wenig","GUV zu Wenig",0]
[{"$nulls":12},0,0,0,"TG zu Wenig","GUV zu Wenig",0]
[{"$nulls":12},0,0,0,"TG zu Wenig","GUV zu Wenig",0]
[{"$nulls":12},0,0,0,"TG zu Wenig","GUV zu Wenig",0]
[{"$nulls":12},0,0,0,"TG zu Wenig","GUV zu Wenig",0]
[{"$nulls":12},0,0,0,"TG zu Wenig","GUV zu Wenig",0]
[{"$nulls":12},0,0,0,"TG zu Wenig","GUV zu Wenig",0]
[{"$nulls":12},0,0,0,"TG zu Wenig","GUV zu Wenig",0]
[{"$nulls":12},0,0,{"$f":"IF(G307=\"GUV\",M307+O306,O306)","v":0},"TG zu Wenig","GUV zu Wenig",0]
[{"$nulls":12},0,0,0,"TG zu Wenig","GUV zu Wenig",0]
[{"$nulls":12},0,0,0,"TG zu Wenig","GUV zu Wenig",0]
[{"$nulls":12},0,0,0,"TG zu Wenig","GUV zu Wenig",0]
[{"$nulls":12},0,0,0,"TG zu Wenig","GUV zu Wenig",0]
[{"$nulls":12},0,0,0,"TG zu Wenig","GUV zu Wenig",0]
[{"$nulls":12},0,0,0,"TG zu Wenig","GUV zu Wenig",0]
[{"$nulls":12},0,0,0,"TG zu Wenig","GUV zu Wenig",0]
[{"$nulls":12},0,0,0,"TG zu Wenig","GUV zu Wenig",0]
[{"$nulls":12},0,0,0,"TG zu Wenig","GUV zu Wenig",0]
[{"$nulls":12},0,0,0,"TG zu Wenig","GUV zu Wenig",0]
[{"$nulls":12},0,0,0,"TG zu Wenig","GUV zu Wenig",0]
[{"$nulls":12},0,0,0,"TG zu Wenig","GUV zu Wenig",0]
[{"$nulls":12},0,0,0,"TG zu Wenig","GUV zu Wenig",0]
[{"$nulls":12},0,0,0,"TG zu Wenig","GUV zu Wenig",0]
[{"$nulls":12},0,0,0,"TG zu Wenig","GUV zu Wenig",0]
[{"$nulls":12},0,0,0,"TG zu Wenig","GUV zu Wenig",0]
[{"$nulls":12},0,0,0,"TG zu Wenig","GUV zu Wenig",0]
[{"$nulls":12},0,0,0,"TG zu Wenig","GUV zu Wenig",0]
[{"$nulls":12},0,0,0,"TG zu Wenig","GUV zu Wenig",0]
[{"$nulls":12},0,0,0,"TG zu Wenig","GUV zu Wenig",0]
[{"$nulls":12},0,0,0,"TG zu Wenig","GUV zu Wenig",0]
[{"$nulls":12},0,0,0,"TG zu Wenig","GUV zu Wenig",0]
[{"$nulls":12},0,0,0,"TG zu Wenig","GUV zu Wenig",0]
[{"$nulls":12},{"$f":"IF(G331=\"GUV\",I331,0)","v":0},0,0,"TG zu Wenig","GUV zu Wenig",0]
[{"$nulls":12},0,{"$f":"IF(G332>0,I332+N331,N331)","v":0},0,"TG zu Wenig","GUV zu Wenig",{"$f":"IF(G332=\"GUV\",1+R331,R331)","v":0}]
[{"$nulls":12},0,0,0,"TG zu Wenig","GUV zu Wenig",0]
[{"$nulls":12},0,0,0,{"$f":"IF(N334>=$N$2,\"TG OK\",\"TG zu Wenig\")","v":"TG zu Wenig"},{"$f":"IF(O334>=$N$3,\"GUV OK\",\"GUV zu Wenig\")","v":"GUV zu Wenig"},0]
[{"$nulls":12},0,0,0,"TG zu Wenig","GUV zu Wenig",0]
[{"$nulls":12},0,0,0,"TG zu Wenig","GUV zu Wenig",0]
[{"$nulls":12},0,0,0,"TG zu Wenig","GUV zu Wenig",0]
[{"$nulls":12},0,0,0,"TG zu Wenig","GUV zu Wenig",0]
[{"$nulls":12},0,0,0,"TG zu Wenig","GUV zu Wenig",0]
[{"$nulls":12},0,0,0,"TG zu Wenig","GUV zu Wenig",0]
[{"$nulls":12},0,0,0,"TG zu Wenig","GUV zu Wenig",0]
[{"$nulls":12},0,0,0,"TG zu Wenig","GUV zu Wenig",0]
[{"$nulls":12},0,0,0,"TG zu Wenig","GUV zu Wenig",0]
[{"$nulls":12},0,0,0,"TG zu Wenig","GUV zu Wenig",0]
[{"$nulls":12},0,0,0,"TG zu Wenig","GUV zu Wenig",0]
[{"$nulls":12},0,0,0,"TG zu Wenig","GUV zu Wenig",0]
[{"$nulls":12},0,0,0,"TG zu Wenig","GUV zu Wenig",0]
[{"$nulls":12},0,0,0,"TG zu Wenig","GUV zu Wenig",0]
[{"$nulls":12},0,0,0,"TG zu Wenig","GUV zu Wenig",0]
[{"$nulls":12},0,0,0,"TG zu Wenig","GUV zu Wenig",0]
[{"$nulls":12},0,0,0,"TG zu Wenig","GUV zu Wenig",0]
[{"$nulls":12},0,0,0,"TG zu Wenig","GUV zu Wenig",0]
[{"$nulls":12},0,0,0,"TG zu Wenig","GUV zu Wenig",0]
[{"$nulls":12},0,0,0,"TG zu Wenig","GUV zu Wenig",0]
[{"$nulls":12},0,0,0,"TG zu Wenig","GUV zu Wenig",0]
[{"$nulls":12},0,0,0,"TG zu Wenig","GUV zu Wenig",0]
[{"$nulls":12},0,0,0,"TG zu Wenig","GUV zu Wenig",0]
[{"$nulls":12},0,0,0,"TG zu Wenig","GUV zu Wenig",0]
[{"$nulls":12},0,0,0,"TG zu Wenig","GUV zu Wenig",0]
[{"$nulls":12},0,0,0,"TG zu Wenig","GUV zu Wenig",0]
[{"$nulls":12},0,0,0,"TG zu Wenig","GUV zu Wenig",0]
[{"$nulls":12},0,0,0,"TG zu Wenig","GUV zu Wenig",0]
[{"$nulls":12},0,0,0,"TG zu Wenig","GUV zu Wenig",0]
[{"$nulls":12},0,0,0,"TG zu Wenig","GUV zu Wenig",0]
[{"$nulls":12},0,0,0,"TG zu Wenig","GUV zu Wenig",0]
[{"$nulls":12},0,0,0,"TG zu Wenig","GUV zu Wenig",0]
[{"$nulls":12},0,0,0,"TG zu Wenig","GUV zu Wenig",0]
[{"$nulls":12},0,0,0,"TG zu Wenig","GUV zu Wenig",0]
[{"$nulls":12},0,0,0,"TG zu Wenig","GUV zu Wenig",0]
[{"$nulls":12},0,0,0,"TG zu Wenig","GUV zu Wenig",0]
[{"$nulls":12},0,0,{"$f":"IF(G371=\"GUV\",M371+O370,O370)","v":0},"TG zu Wenig","GUV zu Wenig",0]
[{"$nulls":12},0,0,0,"TG zu Wenig","GUV zu Wenig",0]
[{"$nulls":12},0,0,0,"TG zu Wenig","GUV zu Wenig",0]
[{"$nulls":12},0,0,0,"TG zu Wenig","GUV zu Wenig",0]
[{"$nulls":12},0,0,0,"TG zu Wenig","GUV zu Wenig",0]
[{"$nulls":12},0,0,0,"TG zu Wenig","GUV zu Wenig",0]
[{"$nulls":12},0,0,0,"TG zu Wenig","GUV zu Wenig",0]
[{"$nulls":12},0,0,0,"TG zu Wenig","GUV zu Wenig",0]
[{"$nulls":12},0,0,0,"TG zu Wenig","GUV zu Wenig",0]
[{"$nulls":12},0,0,0,"TG zu Wenig","GUV zu Wenig",0]
[{"$nulls":12},0,0,0,"TG zu Wenig","GUV zu Wenig",0]
[{"$nulls":12},0,0,0,"TG zu Wenig","GUV zu Wenig",0]
[{"$nulls":12},0,0,0,"TG zu Wenig","GUV zu Wenig",0]
[{"$nulls":12},0,0,0,"TG zu Wenig","GUV zu Wenig",0]
[{"$nulls":12},0,0,0,"TG zu Wenig","GUV zu Wenig",0]
[{"$nulls":12},0,0,0,"TG zu Wenig","GUV zu Wenig",0]
[{"$nulls":12},0,0,0,"TG zu Wenig","GUV zu Wenig",0]
[{"$nulls":12},0,0,0,"TG zu Wenig","GUV zu Wenig",0]
[{"$nulls":12},0,0,0,"TG zu Wenig","GUV zu Wenig",0]
[{"$nulls":12},0,0,0,"TG zu Wenig","GUV zu Wenig",0]
[{"$nulls":12},0,0,0,"TG zu Wenig","GUV zu Wenig",0]
[{"$nulls":12},0,0,0,"TG zu Wenig","GUV zu Wenig",0]
[{"$nulls":12},0,0,0,"TG zu Wenig","GUV zu Wenig",0]
[{"$nulls":12},0,0,0,"TG zu Wenig","GUV zu Wenig",0]
[{"$nulls":12},{"$f":"IF(G395=\"GUV\",I395,0)","v":0},0,0,"TG zu Wenig","GUV zu Wenig",0]
[{"$nulls":12},0,{"$f":"IF(G396>0,I396+N395,N395)","v":0},0,"TG zu Wenig","GUV zu Wenig",{"$f":"IF(G396=\"GUV\",1+R395,R395)","v":0}]
[{"$nulls":12},0,0,0,"TG zu Wenig","GUV zu Wenig",0]
[{"$nulls":12},0,0,0,{"$f":"IF(N398>=$N$2,\"TG OK\",\"TG zu Wenig\")","v":"TG zu Wenig"},{"$f":"IF(O398>=$N$3,\"GUV OK\",\"GUV zu Wenig\")","v":"GUV zu Wenig"},0]
[{"$nulls":12},0,0,0,"TG zu Wenig","GUV zu Wenig",0]
[{"$nulls":12},0,0,0,"TG zu Wenig","GUV zu Wenig",0]
[{"$nulls":12},0,0,0,"TG zu Wenig","GUV zu Wenig",0]
[{"$nulls":12},0,0,0,"TG zu Wenig","GUV zu Wenig",0]
[{"$nulls":12},0,0,0,"TG zu Wenig","GUV zu Wenig",0]
[{"$nulls":12},0,0,0,"TG zu Wenig","GUV zu Wenig",0]
[{"$nulls":12},0,0,0,"TG zu Wenig","GUV zu Wenig",0]
[{"$nulls":12},0,0,0,"TG zu Wenig","GUV zu Wenig",0]
[{"$nulls":12},0,0,0,"TG zu Wenig","GUV zu Wenig",0]
[{"$nulls":12},0,0,0,"TG zu Wenig","GUV zu Wenig",0]
[{"$nulls":12},0,0,0,"TG zu Wenig","GUV zu Wenig",0]
[{"$nulls":12},0,0,0,"TG zu Wenig","GUV zu Wenig",0]
[{"$nulls":12},0,0,0,"TG zu Wenig","GUV zu Wenig",0]
[{"$nulls":12},0,0,0,"TG zu Wenig","GUV zu Wenig",0]
[{"$nulls":12},0,0,0,"TG zu Wenig","GUV zu Wenig",0]
[{"$nulls":12},0,0,0,"TG zu Wenig","GUV zu Wenig",0]
[{"$nulls":12},0,0,0,"TG zu Wenig","GUV zu Wenig",0]
[{"$nulls":12},0,0,0,"TG zu Wenig","GUV zu Wenig",0]
[{"$nulls":12},0,0,0,"TG zu Wenig","GUV zu Wenig",0]
[{"$nulls":12},0,0,0,"TG zu Wenig","GUV zu Wenig",0]
[{"$nulls":12},0,0,0,"TG zu Wenig","GUV zu Wenig",0]
[{"$nulls":12},0,0,0,"TG zu Wenig","GUV zu Wenig",0]
[{"$nulls":12},0,0,0,"TG zu Wenig","GUV zu Wenig",0]
[{"$nulls":12},0,0,0,"TG zu Wenig","GUV zu Wenig",0]
[{"$nulls":12},0,0,0,"TG zu Wenig","GUV zu Wenig",0]
[{"$nulls":12},0,0,0,"TG zu Wenig","GUV zu Wenig",0]
[{"$nulls":12},0,0,0,"TG zu Wenig","GUV zu Wenig",0]
[{"$nulls":12},0,0,0,"TG zu Wenig","GUV zu Wenig",0]
[{"$nulls":12},0,0,0,"TG zu Wenig","GUV zu Wenig",0]
[{"$nulls":12},0,0,0,"TG zu Wenig","GUV zu Wenig",0]
[{"$nulls":12},0,0,0,"TG zu Wenig","GUV zu Wenig",0]
[{"$nulls":12},0,0,0,"TG zu Wenig","GUV zu Wenig",0]
[{"$nulls":12},0,0,0,"TG zu Wenig","GUV zu Wenig",0]
[{"$nulls":12},0,0,0,"TG zu Wenig","GUV zu Wenig",0]
[{"$nulls":12},0,0,0,"TG zu Wenig","GUV zu Wenig",0]
[{"$nulls":12},0,0,0,"TG zu Wenig","GUV zu Wenig",0]
[{"$nulls":12},0,0,{"$f":"IF(G435=\"GUV\",M435+O434,O434)","v":0},"TG zu Wenig","GUV zu Wenig",0]
[{"$nulls":12},0,0,0,"TG zu Wenig","GUV zu Wenig",0]
[{"$nulls":12},0,0,0,"TG zu Wenig","GUV zu Wenig",0]
[{"$nulls":12},0,0,0,"TG zu Wenig","GUV zu Wenig",0]
[{"$nulls":12},0,0,0,"TG zu Wenig","GUV zu Wenig",0]
[{"$nulls":12},0,0,0,"TG zu Wenig","GUV zu Wenig",0]
[{"$nulls":12},0,0,0,"TG zu Wenig","GUV zu Wenig",0]
[{"$nulls":12},0,0,0,"TG zu Wenig","GUV zu Wenig",0]
[{"$nulls":12},0,0,0,"TG zu Wenig","GUV zu Wenig",0]
[{"$nulls":12},0,0,0,"TG zu Wenig","GUV zu Wenig",0]
[{"$nulls":12},0,0,0,"TG zu Wenig","GUV zu Wenig",0]
[{"$nulls":12},0,0,0,"TG zu Wenig","GUV zu Wenig",0]
[{"$nulls":12},0,0,0,"TG zu Wenig","GUV zu Wenig",0]
[{"$nulls":12},0,0,0,"TG zu Wenig","GUV zu Wenig",0]
[{"$nulls":12},0,0,0,"TG zu Wenig","GUV zu Wenig",0]
[{"$nulls":12},0,0,0,"TG zu Wenig","GUV zu Wenig",0]
[{"$nulls":12},0,0,0,"TG zu Wenig","GUV zu Wenig",0]
[{"$nulls":12},0,0,0,"TG zu Wenig","GUV zu Wenig",0]
[{"$nulls":12},0,0,0,"TG zu Wenig","GUV zu Wenig",0]
[{"$nulls":12},0,0,0,"TG zu Wenig","GUV zu Wenig",0]
[{"$nulls":12},0,0,0,"TG zu Wenig","GUV zu Wenig",0]
[{"$nulls":12},0,0,0,"TG zu Wenig","GUV zu Wenig",0]
[{"$nulls":12},0,0,0,"TG zu Wenig","GUV zu Wenig",0]
[{"$nulls":12},0,0,0,"TG zu Wenig","GUV zu Wenig",0]
[{"$nulls":12},{"$f":"IF(G459=\"GUV\",I459,0)","v":0},0,0,"TG zu Wenig","GUV zu Wenig",0]
[{"$nulls":12},0,{"$f":"IF(G460>0,I460+N459,N459)","v":0},0,"TG zu Wenig","GUV zu Wenig",{"$f":"IF(G460=\"GUV\",1+R459,R459)","v":0}]
[{"$nulls":12},0,0,0,"TG zu Wenig","GUV zu Wenig",0]
[{"$nulls":12},0,0,0,{"$f":"IF(N462>=$N$2,\"TG OK\",\"TG zu Wenig\")","v":"TG zu Wenig"},{"$f":"IF(O462>=$N$3,\"GUV OK\",\"GUV zu Wenig\")","v":"GUV zu Wenig"},0]
[{"$nulls":12},0,0,0,"TG zu Wenig","GUV zu Wenig",0]
[{"$nulls":12},0,0,0,"TG zu Wenig","GUV zu Wenig",0]
[{"$nulls":12},0,0,0,"TG zu Wenig","GUV zu Wenig",0]
[{"$nulls":12},0,0,0,"TG zu Wenig","GUV zu Wenig",0]
[{"$nulls":12},0,0,0,"TG zu Wenig","GUV zu Wenig",0]
[{"$nulls":12},0,0,0,"TG zu Wenig","GUV zu Wenig",0]
[{"$nulls":12},0,0,0,"TG zu Wenig","GUV zu Wenig",0]
[{"$nulls":12},0,0,0,"TG zu Wenig","GUV zu Wenig",0]
[{"$nulls":12},0,0,0,"TG zu Wenig","GUV zu Wenig",0]
[{"$nulls":12},0,0,0,"TG zu Wenig","GUV zu Wenig",0]
[{"$nulls":12},0,0,0,"TG zu Wenig","GUV zu Wenig",0]
[{"$nulls":12},0,0,0,"TG zu Wenig","GUV zu Wenig",0]
[{"$nulls":12},0,0,0,"TG zu Wenig","GUV zu Wenig",0]
[{"$nulls":12},0,0,0,"TG zu Wenig","GUV zu Wenig",0]
[{"$nulls":12},0,0,0,"TG zu Wenig","GUV zu Wenig",0]
[{"$nulls":12},0,0,0,"TG zu Wenig","GUV zu Wenig",0]
[{"$nulls":12},0,0,0,"TG zu Wenig","GUV zu Wenig",0]
[{"$nulls":12},0,0,0,"TG zu Wenig","GUV zu Wenig",0]
[{"$nulls":12},0,0,0,"TG zu Wenig","GUV zu Wenig",0]
[{"$nulls":12},0,0,0,"TG zu Wenig","GUV zu Wenig",0]
[{"$nulls":12},0,0,0,"TG zu Wenig","GUV zu Wenig",0]
[{"$nulls":12},0,0,0,"TG zu Wenig","GUV zu Wenig",0]
[{"$nulls":12},0,0,0,"TG zu Wenig","GUV zu Wenig",0]
[{"$nulls":12},0,0,0,"TG zu Wenig","GUV zu Wenig",0]
[{"$nulls":12},0,0,0,"TG zu Wenig","GUV zu Wenig",0]
[{"$nulls":12},0,0,0,"TG zu Wenig","GUV zu Wenig",0]
[{"$nulls":12},0,0,0,"TG zu Wenig","GUV zu Wenig",0]
[{"$nulls":12},0,0,0,"TG zu Wenig","GUV zu Wenig",0]
[{"$nulls":12},0,0,0,"TG zu Wenig","GUV zu Wenig",0]
[{"$nulls":12},0,0,0,"TG zu Wenig","GUV zu Wenig",0]
[{"$nulls":12},0,0,0,"TG zu Wenig","GUV zu Wenig",0]
[{"$nulls":12},0,0,0,"TG zu Wenig","GUV zu Wenig",0]
[{"$nulls":12},0,0,0,"TG zu Wenig","GUV zu Wenig",0]
[{"$nulls":12},0,0,0,"TG zu Wenig","GUV zu Wenig",0]
[{"$nulls":12},0,0,0,"TG zu Wenig","GUV zu Wenig",0]
[{"$nulls":12},0,0,0,"TG zu Wenig","GUV zu Wenig",0]
[{"$nulls":12},0,0,{"$f":"IF(G499=\"GUV\",M499+O498,O498)","v":0},"TG zu Wenig","GUV zu Wenig",0]
[{"$nulls":12},0,0,0,"TG zu Wenig","GUV zu Wenig",0]
[{"$nulls":12},0,0,0,"TG zu Wenig","GUV zu Wenig",0]
[{"$nulls":12},0,0,0,"TG zu Wenig","GUV zu Wenig",0]
[{"$nulls":12},0,0,0,"TG zu Wenig","GUV zu Wenig",0]
[{"$nulls":12},0,0,0,"TG zu Wenig","GUV zu Wenig",0]
[{"$nulls":12},0,0,0,"TG zu Wenig","GUV zu Wenig",0]
[{"$nulls":12},0,0,0,"TG zu Wenig","GUV zu Wenig",0]
[{"$nulls":12},0,0,0,"TG zu Wenig","GUV zu Wenig",0]
[{"$nulls":12},0,0,0,"TG zu Wenig","GUV zu Wenig",0]
[{"$nulls":12},0,0,0,"TG zu Wenig","GUV zu Wenig",0]
[{"$nulls":12},0,0,0,"TG zu Wenig","GUV zu Wenig",0]
[{"$nulls":12},0,0,0,"TG zu Wenig","GUV zu Wenig",0]
[{"$nulls":12},0,0,0,"TG zu Wenig","GUV zu Wenig",0]
[{"$nulls":12},0,0,0,"TG zu Wenig","GUV zu Wenig",0]
[{"$nulls":12},0,0,0,"TG zu Wenig","GUV zu Wenig",0]
[{"$nulls":12},0,0,0,"TG zu Wenig","GUV zu Wenig",0]
[{"$nulls":12},0,0,0,"TG zu Wenig","GUV zu Wenig",0]
[{"$nulls":12},0,0,0,"TG zu Wenig","GUV zu Wenig",0]
[{"$nulls":12},0,0,0,"TG zu Wenig","GUV zu Wenig",0]
[{"$nulls":12},0,0,0,"TG zu Wenig","GUV zu Wenig",0]
[{"$nulls":12},0,0,0,"TG zu Wenig","GUV zu Wenig",0]
[{"$nulls":12},0,0,0,"TG zu Wenig","GUV zu Wenig",0]
[{"$nulls":12},0,0,0,"TG zu Wenig","GUV zu Wenig",0]
[{"$nulls":12},{"$f":"IF(G523=\"GUV\",I523,0)","v":0},0,0,"TG zu Wenig","GUV zu Wenig",0]
[{"$nulls":12},0,{"$f":"IF(G524>0,I524+N523,N523)","v":0},0,"TG zu Wenig","GUV zu Wenig",{"$f":"IF(G524=\"GUV\",1+R523,R523)","v":0}]
[{"$nulls":12},0,0,0,"TG zu Wenig","GUV zu Wenig",0]
[{"$nulls":12},0,0,0,{"$f":"IF(N526>=$N$2,\"TG OK\",\"TG zu Wenig\")","v":"TG zu Wenig"},{"$f":"IF(O526>=$N$3,\"GUV OK\",\"GUV zu Wenig\")","v":"GUV zu Wenig"},0]
[{"$nulls":12},0,0,0,"TG zu Wenig","GUV zu Wenig",0]
[{"$nulls":12},0,0,0,"TG zu Wenig","GUV zu Wenig",0]
[{"$nulls":12},0,0,0,"TG zu Wenig","GUV zu Wenig",0]
[{"$nulls":12},0,0,0,"TG zu Wenig","GUV zu Wenig",0]
[{"$nulls":12},0,0,0,"TG zu Wenig","GUV zu Wenig",0]
[{"$nulls":12},0,0,0,"TG zu Wenig","GUV zu Wenig",0]
[{"$nulls":12},0,0,0,"TG zu Wenig","GUV zu Wenig",0]
[{"$nulls":12},0,0,0,"TG zu Wenig","GUV zu Wenig",0]
[{"$nulls":12},0,0,0,"TG zu Wenig","GUV zu Wenig",0]
[{"$nulls":12},0,0,0,"TG zu Wenig","GUV zu Wenig",0]
[{"$nulls":12},0,0,0,"TG zu Wenig","GUV zu Wenig",0]
[{"$nulls":12},0,0,0,"TG zu Wenig","GUV zu Wenig",0]
[{"$nulls":12},0,0,0,"TG zu Wenig","GUV zu Wenig",0]
[{"$nulls":12},0,0,0,"TG zu Wenig","GUV zu Wenig",0]
[{"$nulls":12},0,0,0,"TG zu Wenig","GUV zu Wenig",0]
[{"$nulls":12},0,0,0,"TG zu Wenig","GUV zu Wenig",0]
[{"$nulls":12},0,0,0,"TG zu Wenig","GUV zu Wenig",0]
[{"$nulls":12},0,0,0,"TG zu Wenig","GUV zu Wenig",0]
[{"$nulls":12},0,0,0,"TG zu Wenig","GUV zu Wenig",0]
[{"$nulls":12},0,0,0,"TG zu Wenig","GUV zu Wenig",0]
[{"$nulls":12},0,0,0,"TG zu Wenig","GUV zu Wenig",0]
[{"$nulls":12},0,0,0,"TG zu Wenig","GUV zu Wenig",0]
[{"$nulls":12},0,0,0,"TG zu Wenig","GUV zu Wenig",0]
[{"$nulls":12},0,0,0,"TG zu Wenig","GUV zu Wenig",0]
[{"$nulls":12},0,0,0,"TG zu Wenig","GUV zu Wenig",0]
[{"$nulls":12},0,0,0,"TG zu Wenig","GUV zu Wenig",0]
[{"$nulls":12},0,0,0,"TG zu Wenig","GUV zu Wenig",0]
[{"$nulls":12},0,0,0,"TG zu Wenig","GUV zu Wenig",0]
[{"$nulls":12},0,0,0,"TG zu Wenig","GUV zu Wenig",0]
[{"$nulls":12},0,0,0,"TG zu Wenig","GUV zu Wenig",0]
[{"$nulls":12},0,0,0,"TG zu Wenig","GUV zu Wenig",0]
[{"$nulls":12},0,0,0,"TG zu Wenig","GUV zu Wenig",0]
[{"$nulls":12},0,0,0,"TG zu Wenig","GUV zu Wenig",0]
[{"$nulls":12},0,0,0,"TG zu Wenig","GUV zu Wenig",0]
[{"$nulls":12},0,0,0,"TG zu Wenig","GUV zu Wenig",0]
[{"$nulls":12},0,0,0,"TG zu Wenig","GUV zu Wenig",0]
[{"$nulls":12},0,0,{"$f":"IF(G563=\"GUV\",M563+O562,O562)","v":0},"TG zu Wenig","GUV zu Wenig",0]
[{"$nulls":12},0,0,0,"TG zu Wenig","GUV zu Wenig",0]
[{"$nulls":12},0,0,0,"TG zu Wenig","GUV zu Wenig",0]
[{"$nulls":12},0,0,0,"TG zu Wenig","GUV zu Wenig",0]
[{"$nulls":12},0,0,0,"TG zu Wenig","GUV zu Wenig",0]
[{"$nulls":12},0,0,0,"TG zu Wenig","GUV zu Wenig",0]
[{"$nulls":12},0,0,0,"TG zu Wenig","GUV zu Wenig",0]
[{"$nulls":12},0,0,0,"TG zu Wenig","GUV zu Wenig",0]
[{"$nulls":12},0,0,0,"TG zu Wenig","GUV zu Wenig",0]
[{"$nulls":12},0,0,0,"TG zu Wenig","GUV zu Wenig",0]
[{"$nulls":12},0,0,0,"TG zu Wenig","GUV zu Wenig",0]
[{"$nulls":12},0,0,0,"TG zu Wenig","GUV zu Wenig",0]
[{"$nulls":12},0,0,0,"TG zu Wenig","GUV zu Wenig",0]
[{"$nulls":12},0,0,0,"TG zu Wenig","GUV zu Wenig",0]
[{"$nulls":12},0,0,0,"TG zu Wenig","GUV zu Wenig",0]
[{"$nulls":12},0,0,0,"TG zu Wenig","GUV zu Wenig",0]
[{"$nulls":12},0,0,0,"TG zu Wenig","GUV zu Wenig",0]
[{"$nulls":12},0,0,0,"TG zu Wenig","GUV zu Wenig",0]
[{"$nulls":12},0,0,0,"TG zu Wenig","GUV zu Wenig",0]
[{"$nulls":12},0,0,0,"TG zu Wenig","GUV zu Wenig",0]
[{"$nulls":12},0,0,0,"TG zu Wenig","GUV zu Wenig",0]
[{"$nulls":12},0,0,0,"TG zu Wenig","GUV zu Wenig",0]
[{"$nulls":12},0,0,0,"TG zu Wenig","GUV zu Wenig",0]
[{"$nulls":12},0,0,0,"TG zu Wenig","GUV zu Wenig",0]
[{"$nulls":12},{"$f":"IF(G587=\"GUV\",I587,0)","v":0},0,0,"TG zu Wenig","GUV zu Wenig",0]
[{"$nulls":12},0,{"$f":"IF(G588>0,I588+N587,N587)","v":0},0,"TG zu Wenig","GUV zu Wenig",{"$f":"IF(G588=\"GUV\",1+R587,R587)","v":0}]
[{"$nulls":12},0,0,0,"TG zu Wenig","GUV zu Wenig",0]
[{"$nulls":12},0,0,0,{"$f":"IF(N590>=$N$2,\"TG OK\",\"TG zu Wenig\")","v":"TG zu Wenig"},{"$f":"IF(O590>=$N$3,\"GUV OK\",\"GUV zu Wenig\")","v":"GUV zu Wenig"},0]
[{"$nulls":12},0,0,0,"TG zu Wenig","GUV zu Wenig",0]
[{"$nulls":12},0,0,0,"TG zu Wenig","GUV zu Wenig",0]
[{"$nulls":12},0,0,0,"TG zu Wenig","GUV zu Wenig",0]
[{"$nulls":12},0,0,0,"TG zu Wenig","GUV zu Wenig",0]
[{"$nulls":12},0,0,0,"TG zu Wenig","GUV zu Wenig",0]
[{"$nulls":12},0,0,0,"TG zu Wenig","GUV zu Wenig",0]
[{"$nulls":12},0,0,0,"TG zu Wenig","GUV zu Wenig",0]
[{"$nulls":12},0,0,0,"TG zu Wenig","GUV zu Wenig",0]
[{"$nulls":12},0,0,0,"TG zu Wenig","GUV zu Wenig",0]
[{"$nulls":12},0,0,0,"TG zu Wenig","GUV zu Wenig",0]
[{"$nulls":12},0,0,0,"TG zu Wenig","GUV zu Wenig",0]
[{"$nulls":12},0,0,0,"TG zu Wenig","GUV zu Wenig",0]
[{"$nulls":12},0,0,0,"TG zu Wenig","GUV zu Wenig",0]
[{"$nulls":12},0,0,0,"TG zu Wenig","GUV zu Wenig",0]
[{"$nulls":12},0,0,0,"TG zu Wenig","GUV zu Wenig",0]
[{"$nulls":12},0,0,0,"TG zu Wenig","GUV zu Wenig",0]
[{"$nulls":12},0,0,0,"TG zu Wenig","GUV zu Wenig",0]
[{"$nulls":12},0,0,0,"TG zu Wenig","GUV zu Wenig",0]
[{"$nulls":12},0,0,0,"TG zu Wenig","GUV zu Wenig",0]
[{"$nulls":12},0,0,0,"TG zu Wenig","GUV zu Wenig",0]
[{"$nulls":12},0,0,0,"TG zu Wenig","GUV zu Wenig",0]
[{"$nulls":12},0,0,0,"TG zu Wenig","GUV zu Wenig",0]
[{"$nulls":12},0,0,0,"TG zu Wenig","GUV zu Wenig",0]
[{"$nulls":12},0,0,0,"TG zu Wenig","GUV zu Wenig",0]
[{"$nulls":12},0,0,0,"TG zu Wenig","GUV zu Wenig",0]
[{"$nulls":12},0,0,0,"TG zu Wenig","GUV zu Wenig",0]
[{"$nulls":12},0,0,0,"TG zu Wenig","GUV zu Wenig",0]
[{"$nulls":12},0,0,0,"TG zu Wenig","GUV zu Wenig",0]
[{"$nulls":12},0,0,0,"TG zu Wenig","GUV zu Wenig",0]
[{"$nulls":12},0,0,0,"TG zu Wenig","GUV zu Wenig",0]
[{"$nulls":12},0,0,0,"TG zu Wenig","GUV zu Wenig",0]
[{"$nulls":12},0,0,0,"TG zu Wenig","GUV zu Wenig",0]
[{"$nulls":12},0,0,0,"TG zu Wenig","GUV zu Wenig",0]
[{"$nulls":12},0,0,0,"TG zu Wenig","GUV zu Wenig",0]
[{"$nulls":12},0,0,0,"TG zu Wenig","GUV zu Wenig",0]
[{"$nulls":12},0,0,0,"TG zu Wenig","GUV zu Wenig",0]
[{"$nulls":12},0,0,{"$f":"IF(G627=\"GUV\",M627+O626,O626)","v":0},"TG zu Wenig","GUV zu Wenig",0]
[{"$nulls":12},0,0,0,"TG zu Wenig","GUV zu Wenig",0]
[{"$nulls":12},0,0,0,"TG zu Wenig","GUV zu Wenig",0]
[{"$nulls":12},0,0,0,"TG zu Wenig","GUV zu Wenig",0]
[{"$nulls":12},0,0,0,"TG zu Wenig","GUV zu Wenig",0]
[{"$nulls":12},0,0,0,"TG zu Wenig","GUV zu Wenig",0]
[{"$nulls":12},0,0,0,"TG zu Wenig","GUV zu Wenig",0]
[{"$nulls":12},0,0,0,"TG zu Wenig","GUV zu Wenig",0]
[{"$nulls":12},0,0,0,"TG zu Wenig","GUV zu Wenig",0]
[{"$nulls":12},0,0,0,"TG zu Wenig","GUV zu Wenig",0]
[{"$nulls":12},0,0,0,"TG zu Wenig","GUV zu Wenig",0]
[{"$nulls":12},0,0,0,"TG zu Wenig","GUV zu Wenig",0]
[{"$nulls":12},0,0,0,"TG zu Wenig","GUV zu Wenig",0]
[{"$nulls":12},0,0,0,"TG zu Wenig","GUV zu Wenig",0]
[{"$nulls":12},0,0,0,"TG zu Wenig","GUV zu Wenig",0]
[{"$nulls":12},0,0,0,"TG zu Wenig","GUV zu Wenig",0]
[{"$nulls":12},0,0,0,"TG zu Wenig","GUV zu Wenig",0]
[{"$nulls":12},0,0,0,"TG zu Wenig","GUV zu Wenig",0]
[{"$nulls":12},0,0,0,"TG zu Wenig","GUV zu Wenig",0]
[{"$nulls":12},0,0,0,"TG zu Wenig","GUV zu Wenig",0]
[{"$nulls":12},0,0,0,"TG zu Wenig","GUV zu Wenig",0]
[{"$nulls":12},0,0,0,"TG zu Wenig","GUV zu Wenig",0]
[{"$nulls":12},0,0,0,"TG zu Wenig","GUV zu Wenig",0]
[{"$nulls":12},0,0,0,"TG zu Wenig","GUV zu Wenig",0]
[{"$nulls":12},{"$f":"IF(G651=\"GUV\",I651,0)","v":0},0,0,"TG zu Wenig","GUV zu Wenig",0]
[{"$nulls":12},0,{"$f":"IF(G652>0,I652+N651,N651)","v":0},0,"TG zu Wenig","GUV zu Wenig",{"$f":"IF(G652=\"GUV\",1+R651,R651)","v":0}]
[{"$nulls":12},0,0,0,"TG zu Wenig","GUV zu Wenig",0]
[{"$nulls":12},0,0,0,{"$f":"IF(N654>=$N$2,\"TG OK\",\"TG zu Wenig\")","v":"TG zu Wenig"},{"$f":"IF(O654>=$N$3,\"GUV OK\",\"GUV zu Wenig\")","v":"GUV zu Wenig"},0]
[{"$nulls":12},0,0,0,"TG zu Wenig","GUV zu Wenig",0]
[{"$nulls":12},0,0,0,"TG zu Wenig","GUV zu Wenig",0]
[{"$nulls":12},0,0,0,"TG zu Wenig","GUV zu Wenig",0]
[{"$nulls":12},0,0,0,"TG zu Wenig","GUV zu Wenig",0]
[{"$nulls":12},0,0,0,"TG zu Wenig","GUV zu Wenig",0]
[{"$nulls":12},0,0,0,"TG zu Wenig","GUV zu Wenig",0]
[{"$nulls":12},0,0,0,"TG zu Wenig","GUV zu Wenig",0]
[{"$nulls":12},0,0,0,"TG zu Wenig","GUV zu Wenig",0]
[{"$nulls":12},0,0,0,"TG zu Wenig","GUV zu Wenig",0]
[{"$nulls":12},0,0,0,"TG zu Wenig","GUV zu Wenig",0]
[{"$nulls":12},0,0,0,"TG zu Wenig","GUV zu Wenig",0]
[{"$nulls":12},0,0,0,"TG zu Wenig","GUV zu Wenig",0]
[{"$nulls":12},0,0,0,"TG zu Wenig","GUV zu Wenig",0]
[{"$nulls":12},0,0,0,"TG zu Wenig","GUV zu Wenig",0]
[{"$nulls":12},0,0,0,"TG zu Wenig","GUV zu Wenig",0]
[{"$nulls":12},0,0,0,"TG zu Wenig","GUV zu Wenig",0]
[{"$nulls":12},0,0,0,"TG zu Wenig","GUV zu Wenig",0]
[{"$nulls":12},0,0,0,"TG zu Wenig","GUV zu Wenig",0]
[{"$nulls":12},0,0,0,"TG zu Wenig","GUV zu Wenig",0]
[{"$nulls":12},0,0,0,"TG zu Wenig","GUV zu Wenig",0]
[{"$nulls":12},0,0,0,"TG zu Wenig","GUV zu Wenig",0]
[{"$nulls":12},0,0,0,"TG zu Wenig","GUV zu Wenig",0]
[{"$nulls":12},0,0,0,"TG zu Wenig","GUV zu Wenig",0]
[{"$nulls":12},0,0,0,"TG zu Wenig","GUV zu Wenig",0]
[{"$nulls":12},0,0,0,"TG zu Wenig","GUV zu Wenig",0]
[{"$nulls":12},0,0,0,"TG zu Wenig","GUV zu Wenig",0]
[{"$nulls":12},0,0,0,"TG zu Wenig","GUV zu Wenig",0]
[{"$nulls":12},0,0,0,"TG zu Wenig","GUV zu Wenig",0]
[{"$nulls":12},0,0,0,"TG zu Wenig","GUV zu Wenig",0]
[{"$nulls":12},0,0,0,"TG zu Wenig","GUV zu Wenig",0]
[{"$nulls":12},0,0,0,"TG zu Wenig","GUV zu Wenig",0]
[{"$nulls":12},0,0,0,"TG zu Wenig","GUV zu Wenig",0]
[{"$nulls":12},0,0,0,"TG zu Wenig","GUV zu Wenig",0]
[{"$nulls":12},0,0,0,"TG zu Wenig","GUV zu Wenig",0]
[{"$nulls":12},0,0,0,"TG zu Wenig","GUV zu Wenig",0]
[{"$nulls":12},0,0,0,"TG zu Wenig","GUV zu Wenig",0]
[{"$nulls":12},0,0,{"$f":"IF(G691=\"GUV\",M691+O690,O690)","v":0},"TG zu Wenig","GUV zu Wenig",0]
[{"$nulls":12},0,0,0,"TG zu Wenig","GUV zu Wenig",0]
[{"$nulls":12},0,0,0,"TG zu Wenig","GUV zu Wenig",0]
[{"$nulls":12},0,0,0,"TG zu Wenig","GUV zu Wenig",0]
[{"$nulls":12},0,0,0,"TG zu Wenig","GUV zu Wenig",0]
[{"$nulls":12},0,0,0,"TG zu Wenig","GUV zu Wenig",0]
[{"$nulls":12},0,0,0,"TG zu Wenig","GUV zu Wenig",0]
[{"$nulls":12},0,0,0,"TG zu Wenig","GUV zu Wenig",0]
[{"$nulls":12},0,0,0,"TG zu Wenig","GUV zu Wenig",0]
[{"$nulls":12},0,0,0,"TG zu Wenig","GUV zu Wenig",0]
[{"$nulls":12},0,0,0,"TG zu Wenig","GUV zu Wenig",0]
[{"$nulls":12},0,0,0,"TG zu Wenig","GUV zu Wenig",0]
[{"$nulls":12},0,0,0,"TG zu Wenig","GUV zu Wenig",0]
[{"$nulls":12},0,0,0,"TG zu Wenig","GUV zu Wenig",0]
[{"$nulls":12},0,0,0,"TG zu Wenig","GUV zu Wenig",0]
[{"$nulls":12},0,0,0,"TG zu Wenig","GUV zu Wenig",0]
[{"$nulls":12},0,0,0,"TG zu Wenig","GUV zu Wenig",0]
[{"$nulls":12},0,0,0,"TG zu Wenig","GUV zu Wenig",0]
[{"$nulls":12},0,0,0,"TG zu Wenig","GUV zu Wenig",0]
[{"$nulls":12},0,0,0,"TG zu Wenig","GUV zu Wenig",0]
[{"$nulls":12},0,0,0,"TG zu Wenig","GUV zu Wenig",0]
[{"$nulls":12},0,0,0,"TG zu Wenig","GUV zu Wenig",0]
[{"$nulls":12},0,0,0,"TG zu Wenig","GUV zu Wenig",0]
[{"$nulls":12},0,0,0,"TG zu Wenig","GUV zu Wenig",0]
[{"$nulls":12},{"$f":"IF(G715=\"GUV\",I715,0)","v":0},0,0,"TG zu Wenig","GUV zu Wenig",0]
[{"$nulls":12},0,{"$f":"IF(G716>0,I716+N715,N715)","v":0},0,"TG zu Wenig","GUV zu Wenig",{"$f":"IF(G716=\"GUV\",1+R715,R715)","v":0}]
[{"$nulls":12},0,0,0,"TG zu Wenig","GUV zu Wenig",0]
[{"$nulls":12},0,0,0,{"$f":"IF(N718>=$N$2,\"TG OK\",\"TG zu Wenig\")","v":"TG zu Wenig"},{"$f":"IF(O718>=$N$3,\"GUV OK\",\"GUV zu Wenig\")","v":"GUV zu Wenig"},0]
[{"$nulls":12},0,0,0,"TG zu Wenig","GUV zu Wenig",0]
[{"$nulls":12},0,0,0,"TG zu Wenig","GUV zu Wenig",0]
[{"$nulls":12},0,0,0,"TG zu Wenig","GUV zu Wenig",0]
[{"$nulls":12},0,0,0,"TG zu Wenig","GUV zu Wenig",0]
[{"$nulls":12},0,0,0,"TG zu Wenig","GUV zu Wenig",0]
[{"$nulls":12},0,0,0,"TG zu Wenig","GUV zu Wenig",0]
[{"$nulls":12},0,0,0,"TG zu Wenig","GUV zu Wenig",0]
[{"$nulls":12},0,0,0,"TG zu Wenig","GUV zu Wenig",0]
[{"$nulls":12},0,0,0,"TG zu Wenig","GUV zu Wenig",0]
[{"$nulls":12},0,0,0,"TG zu Wenig","GUV zu Wenig",0]
[{"$nulls":12},0,0,0,"TG zu Wenig","GUV zu Wenig",0]
[{"$nulls":12},0,0,0,"TG zu Wenig","GUV zu Wenig",0]
[{"$nulls":12},0,0,0,"TG zu Wenig","GUV zu Wenig",0]
[{"$nulls":12},0,0,0,"TG zu Wenig","GUV zu Wenig",0]
[{"$nulls":12},0,0,0,"TG zu Wenig","GUV zu Wenig",0]
[{"$nulls":12},0,0,0,"TG zu Wenig","GUV zu Wenig",0]
[{"$nulls":12},0,0,0,"TG zu Wenig","GUV zu Wenig",0]
[{"$nulls":12},0,0,0,"TG zu Wenig","GUV zu Wenig",0]
[{"$nulls":12},0,0,0,"TG zu Wenig","GUV zu Wenig",0]
[{"$nulls":12},0,0,0,"TG zu Wenig","GUV zu Wenig",0]
[{"$nulls":12},0,0,0,"TG zu Wenig","GUV zu Wenig",0]
[{"$nulls":12},0,0,0,"TG zu Wenig","GUV zu Wenig",0]
[{"$nulls":12},0,0,0,"TG zu Wenig","GUV zu Wenig",0]
[{"$nulls":12},0,0,0,"TG zu Wenig","GUV zu Wenig",0]
[{"$nulls":12},0,0,0,"TG zu Wenig","GUV zu Wenig",0]
[{"$nulls":12},0,0,0,"TG zu Wenig","GUV zu Wenig",0]
[{"$nulls":12},0,0,0,"TG zu Wenig","GUV zu Wenig",0]
[{"$nulls":12},0,0,0,"TG zu Wenig","GUV zu Wenig",0]
[{"$nulls":12},0,0,0,"TG zu Wenig","GUV zu Wenig",0]
[{"$nulls":12},0,0,0,"TG zu Wenig","GUV zu Wenig",0]
[{"$nulls":12},0,0,0,"TG zu Wenig","GUV zu Wenig",0]
[{"$nulls":12},0,0,0,"TG zu Wenig","GUV zu Wenig",0]
[{"$nulls":12},0,0,0,"TG zu Wenig","GUV zu Wenig",0]
[{"$nulls":12},0,0,0,"TG zu Wenig","GUV zu Wenig",0]
[{"$nulls":12},0,0,0,"TG zu Wenig","GUV zu Wenig",0]
[{"$nulls":12},0,0,0,"TG zu Wenig","GUV zu Wenig",0]
[{"$nulls":12},0,0,{"$f":"IF(G755=\"GUV\",M755+O754,O754)","v":0},"TG zu Wenig","GUV zu Wenig",0]
[{"$nulls":12},0,0,0,"TG zu Wenig","GUV zu Wenig",0]
[{"$nulls":12},0,0,0,"TG zu Wenig","GUV zu Wenig",0]
[{"$nulls":12},0,0,0,"TG zu Wenig","GUV zu Wenig",0]
[{"$nulls":12},0,0,0,"TG zu Wenig","GUV zu Wenig",0]
[{"$nulls":12},0,0,0,"TG zu Wenig","GUV zu Wenig",0]
[{"$nulls":12},0,0,0,"TG zu Wenig","GUV zu Wenig",0]
[{"$nulls":12},0,0,0,"TG zu Wenig","GUV zu Wenig",0]
[{"$nulls":12},0,0,0,"TG zu Wenig","GUV zu Wenig",0]
[{"$nulls":12},0,0,0,"TG zu Wenig","GUV zu Wenig",0]
[{"$nulls":12},0,0,0,"TG zu Wenig","GUV zu Wenig",0]
[{"$nulls":12},0,0,0,"TG zu Wenig","GUV zu Wenig",0]
[{"$nulls":12},0,0,0,"TG zu Wenig","GUV zu Wenig",0]
[{"$nulls":12},0,0,0,"TG zu Wenig","GUV zu Wenig",0]
[{"$nulls":12},0,0,0,"TG zu Wenig","GUV zu Wenig",0]
[{"$nulls":12},0,0,0,"TG zu Wenig","GUV zu Wenig",0]
[{"$nulls":12},0,0,0,"TG zu Wenig","GUV zu Wenig",0]
[{"$nulls":12},0,0,0,"TG zu Wenig","GUV zu Wenig",0]
[{"$nulls":12},0,0,0,"TG zu Wenig","GUV zu Wenig",0]
[{"$nulls":12},0,0,0,"TG zu Wenig","GUV zu Wenig",0]
[{"$nulls":12},0,0,0,"TG zu Wenig","GUV zu Wenig",0]
[{"$nulls":12},0,0,0,"TG zu Wenig","GUV zu Wenig",0]
[{"$nulls":12},0,0,0,"TG zu Wenig","GUV zu Wenig",0]
[{"$nulls":12},0,0,0,"TG zu Wenig","GUV zu Wenig",0]
[{"$nulls":12},{"$f":"IF(G779=\"GUV\",I779,0)","v":0},0,0,"TG zu Wenig","GUV zu Wenig",0]
[{"$nulls":12},0,{"$f":"IF(G780>0,I780+N779,N779)","v":0},0,"TG zu Wenig","GUV zu Wenig",{"$f":"IF(G780=\"GUV\",1+R779,R779)","v":0}]
[{"$nulls":12},0,0,0,"TG zu Wenig","GUV zu Wenig",0]
[{"$nulls":12},0,0,0,{"$f":"IF(N782>=$N$2,\"TG OK\",\"TG zu Wenig\")","v":"TG zu Wenig"},{"$f":"IF(O782>=$N$3,\"GUV OK\",\"GUV zu Wenig\")","v":"GUV zu Wenig"},0]
[{"$nulls":12},0,0,0,"TG zu Wenig","GUV zu Wenig",0]
[{"$nulls":12},0,0,0,"TG zu Wenig","GUV zu Wenig",0]
[{"$nulls":12},0,0,0,"TG zu Wenig","GUV zu Wenig",0]
[{"$nulls":12},0,0,0,"TG zu Wenig","GUV zu Wenig",0]
[{"$nulls":12},0,0,0,"TG zu Wenig","GUV zu Wenig",0]
[{"$nulls":12},0,0,0,"TG zu Wenig","GUV zu Wenig",0]
[{"$nulls":12},0,0,0,"TG zu Wenig","GUV zu Wenig",0]
[{"$nulls":12},0,0,0,"TG zu Wenig","GUV zu Wenig",0]
[{"$nulls":12},0,0,0,"TG zu Wenig","GUV zu Wenig",0]
[{"$nulls":12},0,0,0,"TG zu Wenig","GUV zu Wenig",0]
[{"$nulls":12},0,0,0,"TG zu Wenig","GUV zu Wenig",0]
[{"$nulls":12},0,0,0,"TG zu Wenig","GUV zu Wenig",0]
[{"$nulls":12},0,0,0,"TG zu Wenig","GUV zu Wenig",0]
[{"$nulls":12},0,0,0,"TG zu Wenig","GUV zu Wenig",0]
[{"$nulls":12},0,0,0,"TG zu Wenig","GUV zu Wenig",0]
[{"$nulls":12},0,0,0,"TG zu Wenig","GUV zu Wenig",0]
[{"$nulls":12},0,0,0,"TG zu Wenig","GUV zu Wenig",0]
[{"$nulls":12},0,0,0,"TG zu Wenig","GUV zu Wenig",0]
[{"$nulls":12},0,0,0,"TG zu Wenig","GUV zu Wenig",0]
[{"$nulls":12},0,0,0,"TG zu Wenig","GUV zu Wenig",0]
[{"$nulls":12},0,0,0,"TG zu Wenig","GUV zu Wenig",0]
[{"$nulls":12},0,0,0,"TG zu Wenig","GUV zu Wenig",0]
[{"$nulls":12},0,0,0,"TG zu Wenig","GUV zu Wenig",0]
[{"$nulls":12},0,0,0,"TG zu Wenig","GUV zu Wenig",0]
[{"$nulls":12},0,0,0,"TG zu Wenig","GUV zu Wenig",0]
[{"$nulls":12},0,0,0,"TG zu Wenig","GUV zu Wenig",0]
[{"$nulls":12},0,0,0,"TG zu Wenig","GUV zu Wenig",0]
[{"$nulls":12},0,0,0,"TG zu Wenig","GUV zu Wenig",0]
[{"$nulls":12},0,0,0,"TG zu Wenig","GUV zu Wenig",0]
[{"$nulls":12},0,0,0,"TG zu Wenig","GUV zu Wenig",0]
[{"$nulls":12},0,0,0,"TG zu Wenig","GUV zu Wenig",0]
[{"$nulls":12},0,0,0,"TG zu Wenig","GUV zu Wenig",0]
[{"$nulls":12},0,0,0,"TG zu Wenig","GUV zu Wenig",0]
[{"$nulls":12},0,0,0,"TG zu Wenig","GUV zu Wenig",0]
[{"$nulls":12},0,0,0,"TG zu Wenig","GUV zu Wenig",0]
[{"$nulls":12},0,0,0,"TG zu Wenig","GUV zu Wenig",0]
[{"$nulls":12},0,0,{"$f":"IF(G819=\"GUV\",M819+O818,O818)","v":0},"TG zu Wenig","GUV zu Wenig",0]
[{"$nulls":12},0,0,0,"TG zu Wenig","GUV zu Wenig",0]
[{"$nulls":12},0,0,0,"TG zu Wenig","GUV zu Wenig",0]
[{"$nulls":12},0,0,0,"TG zu Wenig","GUV zu Wenig",0]
[{"$nulls":12},0,0,0,"TG zu Wenig","GUV zu Wenig",0]
[{"$nulls":12},0,0,0,"TG zu Wenig","GUV zu Wenig",0]
[{"$nulls":12},0,0,0,"TG zu Wenig","GUV zu Wenig",0]
[{"$nulls":12},0,0,0,"TG zu Wenig","GUV zu Wenig",0]
[{"$nulls":12},0,0,0,"TG zu Wenig","GUV zu Wenig",0]
[{"$nulls":12},0,0,0,"TG zu Wenig","GUV zu Wenig",0]
[{"$nulls":12},0,0,0,"TG zu Wenig","GUV zu Wenig",0]
[{"$nulls":12},0,0,0,"TG zu Wenig","GUV zu Wenig",0]
[{"$nulls":12},0,0,0,"TG zu Wenig","GUV zu Wenig",0]
[{"$nulls":12},0,0,0,"TG zu Wenig","GUV zu Wenig",0]
[{"$nulls":12},0,0,0,"TG zu Wenig","GUV zu Wenig",0]
[{"$nulls":12},0,0,0,"TG zu Wenig","GUV zu Wenig",0]
[{"$nulls":12},0,0,0,"TG zu Wenig","GUV zu Wenig",0]
[{"$nulls":12},0,0,0,"TG zu Wenig","GUV zu Wenig",0]
[{"$nulls":12},0,0,0,"TG zu Wenig","GUV zu Wenig",0]
[{"$nulls":12},0,0,0,"TG zu Wenig","GUV zu Wenig",0]
[{"$nulls":12},0,0,0,"TG zu Wenig","GUV zu Wenig",0]
[{"$nulls":12},0,0,0,"TG zu Wenig","GUV zu Wenig",0]
[{"$nulls":12},0,0,0,"TG zu Wenig","GUV zu Wenig",0]
[{"$nulls":12},0,0,0,"TG zu Wenig","GUV zu Wenig",0]
[{"$nulls":12},{"$f":"IF(G843=\"GUV\",I843,0)","v":0},0,0,"TG zu Wenig","GUV zu Wenig",0]
[{"$nulls":12},0,{"$f":"IF(G844>0,I844+N843,N843)","v":0},0,"TG zu Wenig","GUV zu Wenig",{"$f":"IF(G844=\"GUV\",1+R843,R843)","v":0}]
[{"$nulls":12},0,0,0,"TG zu Wenig","GUV zu Wenig",0]
[{"$nulls":12},0,0,0,{"$f":"IF(N846>=$N$2,\"TG OK\",\"TG zu Wenig\")","v":"TG zu Wenig"},{"$f":"IF(O846>=$N$3,\"GUV OK\",\"GUV zu Wenig\")","v":"GUV zu Wenig"},0]
[{"$nulls":12},0,0,0,"TG zu Wenig","GUV zu Wenig",0]
[{"$nulls":12},0,0,0,"TG zu Wenig","GUV zu Wenig",0]
[{"$nulls":12},0,0,0,"TG zu Wenig","GUV zu Wenig",0]
[{"$nulls":12},0,0,0,"TG zu Wenig","GUV zu Wenig",0]
[{"$nulls":12},0,0,0,"TG zu Wenig","GUV zu Wenig",0]
[{"$nulls":12},0,0,0,"TG zu Wenig","GUV zu Wenig",0]
[{"$nulls":12},0,0,0,"TG zu Wenig","GUV zu Wenig",0]
[{"$nulls":12},0,0,0,"TG zu Wenig","GUV zu Wenig",0]
[{"$nulls":12},0,0,0,"TG zu Wenig","GUV zu Wenig",0]
[{"$nulls":12},0,0,0,"TG zu Wenig","GUV zu Wenig",0]
[{"$nulls":12},0,0,0,"TG zu Wenig","GUV zu Wenig",0]
[{"$nulls":12},0,0,0,"TG zu Wenig","GUV zu Wenig",0]
[{"$nulls":12},0,0,0,"TG zu Wenig","GUV zu Wenig",0]
[{"$nulls":12},0,0,0,"TG zu Wenig","GUV zu Wenig",0]
[{"$nulls":12},0,0,0,"TG zu Wenig","GUV zu Wenig",0]
[{"$nulls":12},0,0,0,"TG zu Wenig","GUV zu Wenig",0]
[{"$nulls":12},0,0,0,"TG zu Wenig","GUV zu Wenig",0]
[{"$nulls":12},0,0,0,"TG zu Wenig","GUV zu Wenig",0]
[{"$nulls":12},0,0,0,"TG zu Wenig","GUV zu Wenig",0]
[{"$nulls":12},0,0,0,"TG zu Wenig","GUV zu Wenig",0]
[{"$nulls":12},0,0,0,"TG zu Wenig","GUV zu Wenig",0]
[{"$nulls":12},0,0,0,"TG zu Wenig","GUV zu Wenig",0]
[{"$nulls":12},0,0,0,"TG zu Wenig","GUV zu Wenig",0]
[{"$nulls":12},0,0,0,"TG zu Wenig","GUV zu Wenig",0]
[{"$nulls":12},0,0,0,"TG zu Wenig","GUV zu Wenig",0]
[{"$nulls":12},0,0,0,"TG zu Wenig","GUV zu Wenig",0]
[{"$nulls":12},0,0,0,"TG zu Wenig","GUV zu Wenig",0]
[{"$nulls":12},0,0,0,"TG zu Wenig","GUV zu Wenig",0]
[{"$nulls":12},0,0,0,"TG zu Wenig","GUV zu Wenig",0]
[{"$nulls":12},0,0,0,"TG zu Wenig","GUV zu Wenig",0]
[{"$nulls":12},0,0,0,"TG zu Wenig","GUV zu Wenig",0]
[{"$nulls":12},0,0,0,"TG zu Wenig","GUV zu Wenig",0]
[{"$nulls":12},0,0,0,"TG zu Wenig","GUV zu Wenig",0]
[{"$nulls":12},0,0,0,"TG zu Wenig","GUV zu Wenig",0]
[{"$nulls":12},0,0,0,"TG zu Wenig","GUV zu Wenig",0]
[{"$nulls":12},0,0,0,"TG zu Wenig","GUV zu Wenig",0]
[{"$nulls":12},0,0,{"$f":"IF(G883=\"GUV\",M883+O882,O882)","v":0},"TG zu Wenig","GUV zu Wenig",0]
[{"$nulls":12},0,0,0,"TG zu Wenig","GUV zu Wenig",0]
[{"$nulls":12},0,0,0,"TG zu Wenig","GUV zu Wenig",0]
[{"$nulls":12},0,0,0,"TG zu Wenig","GUV zu Wenig",0]
[{"$nulls":12},0,0,0,"TG zu Wenig","GUV zu Wenig",0]
[{"$nulls":12},0,0,0,"TG zu Wenig","GUV zu Wenig",0]
[{"$nulls":12},0,0,0,"TG zu Wenig","GUV zu Wenig",0]
[{"$nulls":12},0,0,0,"TG zu Wenig","GUV zu Wenig",0]
[{"$nulls":12},0,0,0,"TG zu Wenig","GUV zu Wenig",0]
[{"$nulls":12},0,0,0,"TG zu Wenig","GUV zu Wenig",0]
[{"$nulls":12},0,0,0,"TG zu Wenig","GUV zu Wenig",0]
[{"$nulls":12},0,0,0,"TG zu Wenig","GUV zu Wenig",0]
[{"$nulls":12},0,0,0,"TG zu Wenig","GUV zu Wenig",0]
[{"$nulls":12},0,0,0,"TG zu Wenig","GUV zu Wenig",0]
[{"$nulls":12},0,0,0,"TG zu Wenig","GUV zu Wenig",0]
[{"$nulls":12},0,0,0,"TG zu Wenig","GUV zu Wenig",0]
[{"$nulls":12},0,0,0,"TG zu Wenig","GUV zu Wenig",0]
[{"$nulls":12},0,0,0,"TG zu Wenig","GUV zu Wenig",0]
[{"$nulls":12},0,0,0,"TG zu Wenig","GUV zu Wenig",0]
[{"$nulls":12},0,0,0,"TG zu Wenig","GUV zu Wenig",0]
[{"$nulls":12},0,0,0,"TG zu Wenig","GUV zu Wenig",0]
[{"$nulls":12},0,0,0,"TG zu Wenig","GUV zu Wenig",0]
[{"$nulls":12},0,0,0,"TG zu Wenig","GUV zu Wenig",0]
[{"$nulls":12},0,0,0,"TG zu Wenig","GUV zu Wenig",0]
[{"$nulls":12},{"$f":"IF(G907=\"GUV\",I907,0)","v":0},0,0,"TG zu Wenig","GUV zu Wenig",0]
[{"$nulls":12},0,{"$f":"IF(G908>0,I908+N907,N907)","v":0},0,"TG zu Wenig","GUV zu Wenig",{"$f":"IF(G908=\"GUV\",1+R907,R907)","v":0}]
[{"$nulls":12},0,0,0,"TG zu Wenig","GUV zu Wenig",0]
[{"$nulls":12},0,0,0,{"$f":"IF(N910>=$N$2,\"TG OK\",\"TG zu Wenig\")","v":"TG zu Wenig"},{"$f":"IF(O910>=$N$3,\"GUV OK\",\"GUV zu Wenig\")","v":"GUV zu Wenig"},0]
[{"$nulls":12},0,0,0,"TG zu Wenig","GUV zu Wenig",0]
[{"$nulls":12},0,0,0,"TG zu Wenig","GUV zu Wenig",0]
[{"$nulls":12},0,0,0,"TG zu Wenig","GUV zu Wenig",0]
[{"$nulls":12},0,0,0,"TG zu Wenig","GUV zu Wenig",0]
[{"$nulls":12},0,0,0,"TG zu Wenig","GUV zu Wenig",0]
[{"$nulls":12},0,0,0,"TG zu Wenig","GUV zu Wenig",0]
[{"$nulls":12},0,0,0,"TG zu Wenig","GUV zu Wenig",0]
[{"$nulls":12},0,0,0,"TG zu Wenig","GUV zu Wenig",0]
[{"$nulls":12},0,0,0,"TG zu Wenig","GUV zu Wenig",0]
[{"$nulls":12},0,0,0,"TG zu Wenig","GUV zu Wenig",0]
[{"$nulls":12},0,0,0,"TG zu Wenig","GUV zu Wenig",0]
[{"$nulls":12},0,0,0,"TG zu Wenig","GUV zu Wenig",0]
[{"$nulls":12},0,0,0,"TG zu Wenig","GUV zu Wenig",0]
[{"$nulls":12},0,0,0,"TG zu Wenig","GUV zu Wenig",0]
[{"$nulls":12},0,0,0,"TG zu Wenig","GUV zu Wenig",0]
[{"$nulls":12},0,0,0,"TG zu Wenig","GUV zu Wenig",0]
[{"$nulls":12},0,0,0,"TG zu Wenig","GUV zu Wenig",0]
[{"$nulls":12},0,0,0,"TG zu Wenig","GUV zu Wenig",0]
[{"$nulls":12},0,0,0,"TG zu Wenig","GUV zu Wenig",0]
[{"$nulls":12},0,0,0,"TG zu Wenig","GUV zu Wenig",0]
[{"$nulls":12},0,0,0,"TG zu Wenig","GUV zu Wenig",0]
[{"$nulls":12},0,0,0,"TG zu Wenig","GUV zu Wenig",0]
[{"$nulls":12},0,0,0,"TG zu Wenig","GUV zu Wenig",0]
[{"$nulls":12},0,0,0,"TG zu Wenig","GUV zu Wenig",0]
[{"$nulls":12},0,0,0,"TG zu Wenig","GUV zu Wenig",0]
[{"$nulls":12},0,0,0,"TG zu Wenig","GUV zu Wenig",0]
[{"$nulls":12},0,0,0,"TG zu Wenig","GUV zu Wenig",0]
[{"$nulls":12},0,0,0,"TG zu Wenig","GUV zu Wenig",0]
[{"$nulls":12},0,0,0,"TG zu Wenig","GUV zu Wenig",0]
[{"$nulls":12},0,0,0,"TG zu Wenig","GUV zu Wenig",0]
[{"$nulls":12},0,0,0,"TG zu Wenig","GUV zu Wenig",0]
[{"$nulls":12},0,0,0,"TG zu Wenig","GUV zu Wenig",0]
[{"$nulls":12},0,0,0,"TG zu Wenig","GUV zu Wenig",0]
[{"$nulls":12},0,0,0,"TG zu Wenig","GUV zu Wenig",0]
[{"$nulls":12},0,0,0,"TG zu Wenig","GUV zu Wenig",0]
[{"$nulls":12},0,0,0,"TG zu Wenig","GUV zu Wenig",0]
[{"$nulls":12},0,0,{"$f":"IF(G947=\"GUV\",M947+O946,O946)","v":0},"TG zu Wenig","GUV zu Wenig",0]
[{"$nulls":12},0,0,0,"TG zu Wenig","GUV zu Wenig",0]
[{"$nulls":12},0,0,0,"TG zu Wenig","GUV zu Wenig",0]
[{"$nulls":12},0,0,0,"TG zu Wenig","GUV zu Wenig",0]
[{"$nulls":12},0,0,0,"TG zu Wenig","GUV zu Wenig",0]
[{"$nulls":12},0,0,0,"TG zu Wenig","GUV zu Wenig",0]
[{"$nulls":12},0,0,0,"TG zu Wenig","GUV zu Wenig",0]
[{"$nulls":12},0,0,0,"TG zu Wenig","GUV zu Wenig",0]
[{"$nulls":12},0,0,0,"TG zu Wenig","GUV zu Wenig",0]
[{"$nulls":12},0,0,0,"TG zu Wenig","GUV zu Wenig",0]
[{"$nulls":12},0,0,0,"TG zu Wenig","GUV zu Wenig",0]
[{"$nulls":12},0,0,0,"TG zu Wenig","GUV zu Wenig",0]
[{"$nulls":12},0,0,0,"TG zu Wenig","GUV zu Wenig",0]
[{"$nulls":12},0,0,0,"TG zu Wenig","GUV zu Wenig",0]
[{"$nulls":12},0,0,0,"TG zu Wenig","GUV zu Wenig",0]
[{"$nulls":12},0,0,0,"TG zu Wenig","GUV zu Wenig",0]
[{"$nulls":12},0,0,0,"TG zu Wenig","GUV zu Wenig",0]
[{"$nulls":12},0,0,0,"TG zu Wenig","GUV zu Wenig",0]
[{"$nulls":12},0,0,0,"TG zu Wenig","GUV zu Wenig",0]
[{"$nulls":12},0,0,0,"TG zu Wenig","GUV zu Wenig",0]
[{"$nulls":12},0,0,0,"TG zu Wenig","GUV zu Wenig",0]
[{"$nulls":12},0,0,0,"TG zu Wenig","GUV zu Wenig",0]
[{"$nulls":12},0,0,0,"TG zu Wenig","GUV zu Wenig",0]
[{"$nulls":12},0,0,0,"TG zu Wenig","GUV zu Wenig",0]
[{"$nulls":12},{"$f":"IF(G971=\"GUV\",I971,0)","v":0},0,0,"TG zu Wenig","GUV zu Wenig",0]
[{"$nulls":12},0,{"$f":"IF(G972>0,I972+N971,N971)","v":0},0,"TG zu Wenig","GUV zu Wenig",{"$f":"IF(G972=\"GUV\",1+R971,R971)","v":0}]
[{"$nulls":12},0,0,0,"TG zu Wenig","GUV zu Wenig",0]
[{"$nulls":12},0,0,0,{"$f":"IF(N974>=$N$2,\"TG OK\",\"TG zu Wenig\")","v":"TG zu Wenig"},{"$f":"IF(O974>=$N$3,\"GUV OK\",\"GUV zu Wenig\")","v":"GUV zu Wenig"},0]
[{"$nulls":12},0,0,0,"TG zu Wenig","GUV zu Wenig",0]
[{"$nulls":12},0,0,0,"TG zu Wenig","GUV zu Wenig",0]
[{"$nulls":12},0,0,0,"TG zu Wenig","GUV zu Wenig",0]
[{"$nulls":12},0,0,0,"TG zu Wenig","GUV zu Wenig",0]
[{"$nulls":12},0,0,0,"TG zu Wenig","GUV zu Wenig",0]
[{"$nulls":12},0,0,0,"TG zu Wenig","GUV zu Wenig",0]
[{"$nulls":12},0,0,0,"TG zu Wenig","GUV zu Wenig",0]
[{"$nulls":12},0,0,0,"TG zu Wenig","GUV zu Wenig",0]
[{"$nulls":12},0,0,0,"TG zu Wenig","GUV zu Wenig",0]
[{"$nulls":12},0,0,0,"TG zu Wenig","GUV zu Wenig",0]
[{"$nulls":12},0,0,0,"TG zu Wenig","GUV zu Wenig",0]
[{"$nulls":12},0,0,0,"TG zu Wenig","GUV zu Wenig",0]
[{"$nulls":12},0,0,0,"TG zu Wenig","GUV zu Wenig",0]
[{"$nulls":12},0,0,0,"TG zu Wenig","GUV zu Wenig",0]
[{"$nulls":12},0,0,0,"TG zu Wenig","GUV zu Wenig",0]
[{"$nulls":12},0,0,0,"TG zu Wenig","GUV zu Wenig",0]
[{"$nulls":12},0,0,0,"TG zu Wenig","GUV zu Wenig",0]
[{"$nulls":12},0,0,0,"TG zu Wenig","GUV zu Wenig",0]
[{"$nulls":12},0,0,0,"TG zu Wenig","GUV zu Wenig",0]
[{"$nulls":12},0,0,0,"TG zu Wenig","GUV zu Wenig",0]
[{"$nulls":12},0,0,0,"TG zu Wenig","GUV zu Wenig",0]
[{"$nulls":12},0,0,0,"TG zu Wenig","GUV zu Wenig",0]
[{"$nulls":12},0,0,0,"TG zu Wenig","GUV zu Wenig",0]
[{"$nulls":12},0,0,0,"TG zu Wenig","GUV zu Wenig",0]
[{"$nulls":12},0,0,0,"TG zu Wenig","GUV zu Wenig",0]
[{"$nulls":12},0,0,0,"TG zu Wenig","GUV zu Wenig",0]